INFO:2025-03-19T20:28:48Z:root:pulling...
From github.com:llvm/llvm-project
 * branch                      main       -> FETCH_HEAD
   0827e3aae6eb..a810141281cc  main       -> origin/main
Switched to branch 'main'
Your branch is behind 'origin/main' by 1 commit, and can be fast-forwarded.
  (use "git pull" to update your local branch)
HEAD is now at a810141281cc [mlir][memref] Add runtime verification for `memref.assume_alignment` (#130412)
INFO:2025-03-19T20:28:51Z:root:syncing...
Deleted branch merge (was 0827e3aae6eb).
Switched to a new branch 'merge'
branch 'merge' set up to track 'origin/main'.
INFO:2025-03-19T20:28:51Z:root:building
ninja: Entering directory `out/gn'
ninja: no work to do.
INFO:2025-03-19T20:28:51Z:root:analyze
skipping analyze because previous build was not green
INFO:2025-03-19T20:28:51Z:root:testing
INFO:2025-03-19T20:28:51Z:root:test check-clang
ninja: Entering directory `out/gn'
[0/2] ACTION //clang/test:check-clang(//llvm/utils/gn/build/toolchain:unix)
llvm-lit: /usr/local/google/home/thakis/src/llvm-project/llvm/utils/lit/lit/llvm/config.py:520: note: using clang: /usr/local/google/home/thakis/src/llvm-project/out/gn/bin/clang
llvm-lit: /usr/local/google/home/thakis/src/llvm-project/llvm/utils/lit/lit/llvm/subst.py:126: note: Did not find cir-opt in /usr/local/google/home/thakis/src/llvm-project/out/gn/bin:/usr/local/google/home/thakis/src/llvm-project/out/gn/bin
llvm-lit: /usr/local/google/home/thakis/src/llvm-project/llvm/utils/lit/lit/llvm/config.py:520: note: using ld.lld: /usr/local/google/home/thakis/src/llvm-project/out/gn/bin/ld.lld
llvm-lit: /usr/local/google/home/thakis/src/llvm-project/llvm/utils/lit/lit/llvm/config.py:520: note: using lld-link: /usr/local/google/home/thakis/src/llvm-project/out/gn/bin/lld-link
llvm-lit: /usr/local/google/home/thakis/src/llvm-project/llvm/utils/lit/lit/llvm/config.py:520: note: using ld64.lld: /usr/local/google/home/thakis/src/llvm-project/out/gn/bin/ld64.lld
llvm-lit: /usr/local/google/home/thakis/src/llvm-project/llvm/utils/lit/lit/llvm/config.py:520: note: using wasm-ld: /usr/local/google/home/thakis/src/llvm-project/out/gn/bin/wasm-ld
-- Testing: 22199 tests, 64 workers --
Testing:  0.. 10.. 20.. 30.. 40.. 50.. 60.. 70.. 80.. 90.. 

Testing Time: 129.76s

Total Discovered Tests: 46810
  Skipped          :     4 (0.01%)
  Unsupported      :   144 (0.31%)
  Passed           : 46631 (99.62%)
  Expectedly Failed:    31 (0.07%)
INFO:2025-03-19T20:31:04Z:root:test check-clang-tools
ninja: Entering directory `out/gn'
[0/2] ACTION //clang-tools-extra/test:check-clang-tools(//llvm/utils/gn/build/toolchain:unix)
llvm-lit: /usr/local/google/home/thakis/src/llvm-project/llvm/utils/lit/lit/llvm/config.py:520: note: using clang: /usr/local/google/home/thakis/src/llvm-project/out/gn/bin/clang
-- Testing: 1186 tests, 64 workers --
Testing:  0.. 10.. 20.. 30.. 40.. 50.. 60.. 70.. 80.. 90.. 

Testing Time: 6.70s

Total Discovered Tests: 1428
  Unsupported      :    2 (0.14%)
  Passed           : 1425 (99.79%)
  Expectedly Failed:    1 (0.07%)
INFO:2025-03-19T20:31:12Z:root:test check-clangd
ninja: Entering directory `out/gn'
[0/2] ACTION //clang-tools-extra/clangd/test:check-clangd(//llvm/utils/gn/build/toolchain:unix)
llvm-lit: /usr/local/google/home/thakis/src/llvm-project/llvm/utils/lit/lit/llvm/config.py:520: note: using clang: /usr/local/google/home/thakis/src/llvm-project/out/gn/bin/clang
-- Testing: 168 tests, 64 workers --
Testing:  0.. 10.. 20.. 30.. 40.. 50.. 60.. 70.. 80.. 90.. 

Testing Time: 5.62s

Total Discovered Tests: 1372
  Unsupported:    6 (0.44%)
  Passed     : 1366 (99.56%)
INFO:2025-03-19T20:31:18Z:root:test check-hwasan
ninja: Entering directory `out/gn'
[0/2] ACTION //compiler-rt/test/hwasan:check-hwasan(//llvm/utils/gn/build/toolchain:unix)
llvm-lit: /usr/local/google/home/thakis/src/llvm-project/compiler-rt/test/lit.common.cfg.py:60: warning: Path reported by clang does not exist: "/usr/local/google/home/thakis/src/llvm-project/out/gn/lib/clang/21/lib/x86_64-unknown-linux-gnu". This path was found by running ['/usr/local/google/home/thakis/src/llvm-project/out/gn/bin/clang', '--target=x86_64-unknown-linux-gnu', '-print-runtime-dir'].
-- Testing: 109 tests, 64 workers --
Testing:  0.. 10.. 20.. 30.. 40.. 50.. 60.. 70.. 80.. 90.. 

1 warning(s) in tests

Testing Time: 8.20s

Total Discovered Tests: 109
  Unsupported      : 37 (33.94%)
  Passed           : 63 (57.80%)
  Expectedly Failed:  9 (8.26%)
INFO:2025-03-19T20:31:27Z:root:test check-lld
ninja: Entering directory `out/gn'
[0/2] ACTION //lld/test:check-lld(//llvm/utils/gn/build/toolchain:unix)
llvm-lit: /usr/local/google/home/thakis/src/llvm-project/llvm/utils/lit/lit/llvm/config.py:520: note: using ld.lld: /usr/local/google/home/thakis/src/llvm-project/out/gn/bin/ld.lld
llvm-lit: /usr/local/google/home/thakis/src/llvm-project/llvm/utils/lit/lit/llvm/config.py:520: note: using lld-link: /usr/local/google/home/thakis/src/llvm-project/out/gn/bin/lld-link
llvm-lit: /usr/local/google/home/thakis/src/llvm-project/llvm/utils/lit/lit/llvm/config.py:520: note: using ld64.lld: /usr/local/google/home/thakis/src/llvm-project/out/gn/bin/ld64.lld
llvm-lit: /usr/local/google/home/thakis/src/llvm-project/llvm/utils/lit/lit/llvm/config.py:520: note: using wasm-ld: /usr/local/google/home/thakis/src/llvm-project/out/gn/bin/wasm-ld
-- Testing: 3069 tests, 64 workers --
Testing:  0.. 10.. 20.. 30.. 40.. 50.. 60.. 70.. 80.. 90.. 

Testing Time: 13.64s

Total Discovered Tests: 3069
  Unsupported      :   21 (0.68%)
  Passed           : 3047 (99.28%)
  Expectedly Failed:    1 (0.03%)
INFO:2025-03-19T20:31:41Z:root:test check-llvm
ninja: Entering directory `out/gn'
[0/2] ACTION //llvm/test:check-llvm(//llvm/utils/gn/build/toolchain:unix)
llvm-lit: /usr/local/google/home/thakis/src/llvm-project/llvm/utils/lit/lit/llvm/config.py:520: note: using ld.lld: /usr/local/google/home/thakis/src/llvm-project/out/gn/bin/ld.lld
llvm-lit: /usr/local/google/home/thakis/src/llvm-project/llvm/utils/lit/lit/llvm/config.py:520: note: using lld-link: /usr/local/google/home/thakis/src/llvm-project/out/gn/bin/lld-link
llvm-lit: /usr/local/google/home/thakis/src/llvm-project/llvm/utils/lit/lit/llvm/config.py:520: note: using ld64.lld: /usr/local/google/home/thakis/src/llvm-project/out/gn/bin/ld64.lld
llvm-lit: /usr/local/google/home/thakis/src/llvm-project/llvm/utils/lit/lit/llvm/config.py:520: note: using wasm-ld: /usr/local/google/home/thakis/src/llvm-project/out/gn/bin/wasm-ld
-- Testing: 58674 tests, 64 workers --
Testing: 
FAIL: LLVM :: tools/llvm-ml/feat00_override.asm (1 of 58674)
******************** TEST 'LLVM :: tools/llvm-ml/feat00_override.asm' FAILED ********************
Exit Code: 2

Command Output (stderr):
--
RUN: at line 1: llvm-ml /usr/local/google/home/thakis/src/llvm-project/llvm/test/tools/llvm-ml/feat00_override.asm /Fo - | /usr/local/google/home/thakis/src/llvm-project/out/gn/bin/llvm-readobj --syms - | /usr/local/google/home/thakis/src/llvm-project/out/gn/bin/FileCheck /usr/local/google/home/thakis/src/llvm-project/llvm/test/tools/llvm-ml/feat00_override.asm
+ llvm-ml /usr/local/google/home/thakis/src/llvm-project/llvm/test/tools/llvm-ml/feat00_override.asm /Fo -
+ /usr/local/google/home/thakis/src/llvm-project/out/gn/bin/llvm-readobj --syms -
+ /usr/local/google/home/thakis/src/llvm-project/out/gn/bin/FileCheck /usr/local/google/home/thakis/src/llvm-project/llvm/test/tools/llvm-ml/feat00_override.asm
RUN: at line 2: llvm-ml64 /usr/local/google/home/thakis/src/llvm-project/llvm/test/tools/llvm-ml/feat00_override.asm /Fo - | /usr/local/google/home/thakis/src/llvm-project/out/gn/bin/llvm-readobj --syms - | /usr/local/google/home/thakis/src/llvm-project/out/gn/bin/FileCheck /usr/local/google/home/thakis/src/llvm-project/llvm/test/tools/llvm-ml/feat00_override.asm
+ llvm-ml64 /usr/local/google/home/thakis/src/llvm-project/llvm/test/tools/llvm-ml/feat00_override.asm /Fo -
/usr/local/google/home/thakis/src/llvm-project/out/gn/obj/llvm/test/tools/llvm-ml/Output/feat00_override.asm.script: line 2: llvm-ml64: command not found
+ /usr/local/google/home/thakis/src/llvm-project/out/gn/bin/llvm-readobj --syms -
+ /usr/local/google/home/thakis/src/llvm-project/out/gn/bin/FileCheck /usr/local/google/home/thakis/src/llvm-project/llvm/test/tools/llvm-ml/feat00_override.asm
/usr/local/google/home/thakis/src/llvm-project/out/gn/bin/llvm-readobj: error: '<stdin>': The file was not recognized as a valid object file
FileCheck error: '<stdin>' is empty.
FileCheck command line:  /usr/local/google/home/thakis/src/llvm-project/out/gn/bin/FileCheck /usr/local/google/home/thakis/src/llvm-project/llvm/test/tools/llvm-ml/feat00_override.asm

--

********************
Testing: 
FAIL: LLVM :: tools/llvm-ml/feat00.asm (2 of 58674)
******************** TEST 'LLVM :: tools/llvm-ml/feat00.asm' FAILED ********************
Exit Code: 2

Command Output (stderr):
--
RUN: at line 1: llvm-ml /usr/local/google/home/thakis/src/llvm-project/llvm/test/tools/llvm-ml/feat00.asm /Fo - | /usr/local/google/home/thakis/src/llvm-project/out/gn/bin/llvm-readobj --syms - | /usr/local/google/home/thakis/src/llvm-project/out/gn/bin/FileCheck /usr/local/google/home/thakis/src/llvm-project/llvm/test/tools/llvm-ml/feat00.asm --check-prefix=CHECK-OBJ --check-prefix=CHECK-OBJ-NOSAFESEH
+ llvm-ml /usr/local/google/home/thakis/src/llvm-project/llvm/test/tools/llvm-ml/feat00.asm /Fo -
+ /usr/local/google/home/thakis/src/llvm-project/out/gn/bin/llvm-readobj --syms -
+ /usr/local/google/home/thakis/src/llvm-project/out/gn/bin/FileCheck /usr/local/google/home/thakis/src/llvm-project/llvm/test/tools/llvm-ml/feat00.asm --check-prefix=CHECK-OBJ --check-prefix=CHECK-OBJ-NOSAFESEH
RUN: at line 2: llvm-ml64 /usr/local/google/home/thakis/src/llvm-project/llvm/test/tools/llvm-ml/feat00.asm /Fo - | /usr/local/google/home/thakis/src/llvm-project/out/gn/bin/llvm-readobj --syms - | /usr/local/google/home/thakis/src/llvm-project/out/gn/bin/FileCheck /usr/local/google/home/thakis/src/llvm-project/llvm/test/tools/llvm-ml/feat00.asm --check-prefix=CHECK-OBJ --check-prefix=CHECK-OBJ-NOSAFESEH
+ llvm-ml64 /usr/local/google/home/thakis/src/llvm-project/llvm/test/tools/llvm-ml/feat00.asm /Fo -
/usr/local/google/home/thakis/src/llvm-project/out/gn/obj/llvm/test/tools/llvm-ml/Output/feat00.asm.script: line 2: llvm-ml64: command not found
+ /usr/local/google/home/thakis/src/llvm-project/out/gn/bin/llvm-readobj --syms -
+ /usr/local/google/home/thakis/src/llvm-project/out/gn/bin/FileCheck /usr/local/google/home/thakis/src/llvm-project/llvm/test/tools/llvm-ml/feat00.asm --check-prefix=CHECK-OBJ --check-prefix=CHECK-OBJ-NOSAFESEH
/usr/local/google/home/thakis/src/llvm-project/out/gn/bin/llvm-readobj: error: '<stdin>': The file was not recognized as a valid object file
FileCheck error: '<stdin>' is empty.
FileCheck command line:  /usr/local/google/home/thakis/src/llvm-project/out/gn/bin/FileCheck /usr/local/google/home/thakis/src/llvm-project/llvm/test/tools/llvm-ml/feat00.asm --check-prefix=CHECK-OBJ --check-prefix=CHECK-OBJ-NOSAFESEH

--

********************
Testing: 
FAIL: LLVM :: tools/llvm-ml/proc.asm (3 of 58674)
******************** TEST 'LLVM :: tools/llvm-ml/proc.asm' FAILED ********************
Exit Code: 2

Command Output (stderr):
--
RUN: at line 1: llvm-ml -filetype=s /usr/local/google/home/thakis/src/llvm-project/llvm/test/tools/llvm-ml/proc.asm /Fo - | /usr/local/google/home/thakis/src/llvm-project/out/gn/bin/FileCheck /usr/local/google/home/thakis/src/llvm-project/llvm/test/tools/llvm-ml/proc.asm
+ llvm-ml -filetype=s /usr/local/google/home/thakis/src/llvm-project/llvm/test/tools/llvm-ml/proc.asm /Fo -
+ /usr/local/google/home/thakis/src/llvm-project/out/gn/bin/FileCheck /usr/local/google/home/thakis/src/llvm-project/llvm/test/tools/llvm-ml/proc.asm
RUN: at line 2: llvm-ml64 -filetype=s /usr/local/google/home/thakis/src/llvm-project/llvm/test/tools/llvm-ml/proc.asm /Fo - | /usr/local/google/home/thakis/src/llvm-project/out/gn/bin/FileCheck /usr/local/google/home/thakis/src/llvm-project/llvm/test/tools/llvm-ml/proc.asm
+ llvm-ml64 -filetype=s /usr/local/google/home/thakis/src/llvm-project/llvm/test/tools/llvm-ml/proc.asm /Fo -
/usr/local/google/home/thakis/src/llvm-project/out/gn/obj/llvm/test/tools/llvm-ml/Output/proc.asm.script: line 2: llvm-ml64: command not found
+ /usr/local/google/home/thakis/src/llvm-project/out/gn/bin/FileCheck /usr/local/google/home/thakis/src/llvm-project/llvm/test/tools/llvm-ml/proc.asm
FileCheck error: '<stdin>' is empty.
FileCheck command line:  /usr/local/google/home/thakis/src/llvm-project/out/gn/bin/FileCheck /usr/local/google/home/thakis/src/llvm-project/llvm/test/tools/llvm-ml/proc.asm

--

********************
Testing: 
FAIL: LLVM :: tools/llvm-ml/architecture_errors.asm (4 of 58674)
******************** TEST 'LLVM :: tools/llvm-ml/architecture_errors.asm' FAILED ********************
Exit Code: 1

Command Output (stderr):
--
RUN: at line 1: not llvm-ml -filetype=s /usr/local/google/home/thakis/src/llvm-project/llvm/test/tools/llvm-ml/architecture_errors.asm /Fo - 2>&1 | /usr/local/google/home/thakis/src/llvm-project/out/gn/bin/FileCheck /usr/local/google/home/thakis/src/llvm-project/llvm/test/tools/llvm-ml/architecture_errors.asm
+ not llvm-ml -filetype=s /usr/local/google/home/thakis/src/llvm-project/llvm/test/tools/llvm-ml/architecture_errors.asm /Fo -
+ /usr/local/google/home/thakis/src/llvm-project/out/gn/bin/FileCheck /usr/local/google/home/thakis/src/llvm-project/llvm/test/tools/llvm-ml/architecture_errors.asm
RUN: at line 2: not llvm-ml -m32 -filetype=s /usr/local/google/home/thakis/src/llvm-project/llvm/test/tools/llvm-ml/architecture_errors.asm /Fo - 2>&1 | /usr/local/google/home/thakis/src/llvm-project/out/gn/bin/FileCheck /usr/local/google/home/thakis/src/llvm-project/llvm/test/tools/llvm-ml/architecture_errors.asm
+ not llvm-ml -m32 -filetype=s /usr/local/google/home/thakis/src/llvm-project/llvm/test/tools/llvm-ml/architecture_errors.asm /Fo -
+ /usr/local/google/home/thakis/src/llvm-project/out/gn/bin/FileCheck /usr/local/google/home/thakis/src/llvm-project/llvm/test/tools/llvm-ml/architecture_errors.asm
RUN: at line 3: not llvm-ml64 -m32 -filetype=s /usr/local/google/home/thakis/src/llvm-project/llvm/test/tools/llvm-ml/architecture_errors.asm /Fo - 2>&1 | /usr/local/google/home/thakis/src/llvm-project/out/gn/bin/FileCheck /usr/local/google/home/thakis/src/llvm-project/llvm/test/tools/llvm-ml/architecture_errors.asm
+ not llvm-ml64 -m32 -filetype=s /usr/local/google/home/thakis/src/llvm-project/llvm/test/tools/llvm-ml/architecture_errors.asm /Fo -
+ /usr/local/google/home/thakis/src/llvm-project/out/gn/bin/FileCheck /usr/local/google/home/thakis/src/llvm-project/llvm/test/tools/llvm-ml/architecture_errors.asm
/usr/local/google/home/thakis/src/llvm-project/llvm/test/tools/llvm-ml/architecture_errors.asm:7:10: error: CHECK: expected string not found in input
; CHECK: :[[# @LINE + 1]]:5: error: register %rax is only available in 64-bit mode
         ^
<stdin>:1:1: note: scanning from here
error: unable to find `llvm-ml64' in PATH: No such file or directory
^
<stdin>:1:1: note: with " @LINE + 1" equal to "8"
error: unable to find `llvm-ml64' in PATH: No such file or directory
^
<stdin>:1:30: note: possible intended match here
error: unable to find `llvm-ml64' in PATH: No such file or directory
                             ^

Input file: <stdin>
Check file: /usr/local/google/home/thakis/src/llvm-project/llvm/test/tools/llvm-ml/architecture_errors.asm

-dump-input=help explains the following input dump.

Input was:
<<<<<<
           1: error: unable to find `llvm-ml64' in PATH: No such file or directory 
check:7'0     X~~~~~~~~~~~~~~~~~~~~~~~~~~~~~~~~~~~~~~~~~~~~~~~~~~~~~~~~~~~~~~~~~~~~ error: no match found
check:7'1                                                                           with " @LINE + 1" equal to "8"
check:7'2                                  ?                                        possible intended match
>>>>>>

--

********************
Testing: 
FAIL: LLVM :: tools/llvm-ml/rip_relative_addressing.asm (5 of 58674)
******************** TEST 'LLVM :: tools/llvm-ml/rip_relative_addressing.asm' FAILED ********************
Exit Code: 2

Command Output (stderr):
--
RUN: at line 1: llvm-ml -filetype=s /usr/local/google/home/thakis/src/llvm-project/llvm/test/tools/llvm-ml/rip_relative_addressing.asm /Fo - | /usr/local/google/home/thakis/src/llvm-project/out/gn/bin/FileCheck /usr/local/google/home/thakis/src/llvm-project/llvm/test/tools/llvm-ml/rip_relative_addressing.asm --check-prefixes=CHECK,CHECK-32
+ llvm-ml -filetype=s /usr/local/google/home/thakis/src/llvm-project/llvm/test/tools/llvm-ml/rip_relative_addressing.asm /Fo -
+ /usr/local/google/home/thakis/src/llvm-project/out/gn/bin/FileCheck /usr/local/google/home/thakis/src/llvm-project/llvm/test/tools/llvm-ml/rip_relative_addressing.asm --check-prefixes=CHECK,CHECK-32
RUN: at line 2: llvm-ml64 -filetype=s /usr/local/google/home/thakis/src/llvm-project/llvm/test/tools/llvm-ml/rip_relative_addressing.asm /Fo - | /usr/local/google/home/thakis/src/llvm-project/out/gn/bin/FileCheck /usr/local/google/home/thakis/src/llvm-project/llvm/test/tools/llvm-ml/rip_relative_addressing.asm --check-prefixes=CHECK,CHECK-64
+ llvm-ml64 -filetype=s /usr/local/google/home/thakis/src/llvm-project/llvm/test/tools/llvm-ml/rip_relative_addressing.asm /Fo -
/usr/local/google/home/thakis/src/llvm-project/out/gn/obj/llvm/test/tools/llvm-ml/Output/rip_relative_addressing.asm.script: line 2: llvm-ml64: command not found
+ /usr/local/google/home/thakis/src/llvm-project/out/gn/bin/FileCheck /usr/local/google/home/thakis/src/llvm-project/llvm/test/tools/llvm-ml/rip_relative_addressing.asm --check-prefixes=CHECK,CHECK-64
FileCheck error: '<stdin>' is empty.
FileCheck command line:  /usr/local/google/home/thakis/src/llvm-project/out/gn/bin/FileCheck /usr/local/google/home/thakis/src/llvm-project/llvm/test/tools/llvm-ml/rip_relative_addressing.asm --check-prefixes=CHECK,CHECK-64

--

********************
Testing: 
FAIL: LLVM :: tools/llvm-ml/indirect_branch.asm (6 of 58674)
******************** TEST 'LLVM :: tools/llvm-ml/indirect_branch.asm' FAILED ********************
Exit Code: 2

Command Output (stderr):
--
RUN: at line 1: llvm-ml64 -filetype=s /usr/local/google/home/thakis/src/llvm-project/llvm/test/tools/llvm-ml/indirect_branch.asm /Fo - | /usr/local/google/home/thakis/src/llvm-project/out/gn/bin/FileCheck /usr/local/google/home/thakis/src/llvm-project/llvm/test/tools/llvm-ml/indirect_branch.asm --check-prefixes=CHECK-64,CHECK
+ llvm-ml64 -filetype=s /usr/local/google/home/thakis/src/llvm-project/llvm/test/tools/llvm-ml/indirect_branch.asm /Fo -
/usr/local/google/home/thakis/src/llvm-project/out/gn/obj/llvm/test/tools/llvm-ml/Output/indirect_branch.asm.script: line 1: llvm-ml64: command not found
+ /usr/local/google/home/thakis/src/llvm-project/out/gn/bin/FileCheck /usr/local/google/home/thakis/src/llvm-project/llvm/test/tools/llvm-ml/indirect_branch.asm --check-prefixes=CHECK-64,CHECK
FileCheck error: '<stdin>' is empty.
FileCheck command line:  /usr/local/google/home/thakis/src/llvm-project/out/gn/bin/FileCheck /usr/local/google/home/thakis/src/llvm-project/llvm/test/tools/llvm-ml/indirect_branch.asm --check-prefixes=CHECK-64,CHECK

--

********************
Testing: 
FAIL: LLVM :: tools/llvm-ml/architecture.asm (7 of 58674)
******************** TEST 'LLVM :: tools/llvm-ml/architecture.asm' FAILED ********************
Exit Code: 2

Command Output (stderr):
--
RUN: at line 1: llvm-ml64 -filetype=s /usr/local/google/home/thakis/src/llvm-project/llvm/test/tools/llvm-ml/architecture.asm /Fo - | /usr/local/google/home/thakis/src/llvm-project/out/gn/bin/FileCheck /usr/local/google/home/thakis/src/llvm-project/llvm/test/tools/llvm-ml/architecture.asm --implicit-check-not=error:
+ llvm-ml64 -filetype=s /usr/local/google/home/thakis/src/llvm-project/llvm/test/tools/llvm-ml/architecture.asm /Fo -
/usr/local/google/home/thakis/src/llvm-project/out/gn/obj/llvm/test/tools/llvm-ml/Output/architecture.asm.script: line 1: llvm-ml64: command not found
+ /usr/local/google/home/thakis/src/llvm-project/out/gn/bin/FileCheck /usr/local/google/home/thakis/src/llvm-project/llvm/test/tools/llvm-ml/architecture.asm --implicit-check-not=error:
FileCheck error: '<stdin>' is empty.
FileCheck command line:  /usr/local/google/home/thakis/src/llvm-project/out/gn/bin/FileCheck /usr/local/google/home/thakis/src/llvm-project/llvm/test/tools/llvm-ml/architecture.asm --implicit-check-not=error:

--

********************
Testing: 
FAIL: LLVM :: tools/llvm-ml/strings_errors.asm (8 of 58674)
******************** TEST 'LLVM :: tools/llvm-ml/strings_errors.asm' FAILED ********************
Exit Code: 1

Command Output (stderr):
--
RUN: at line 1: not llvm-ml64 -filetype=s /usr/local/google/home/thakis/src/llvm-project/llvm/test/tools/llvm-ml/strings_errors.asm /Fo /dev/null 2>&1 | /usr/local/google/home/thakis/src/llvm-project/out/gn/bin/FileCheck /usr/local/google/home/thakis/src/llvm-project/llvm/test/tools/llvm-ml/strings_errors.asm --implicit-check-not=error:
+ not llvm-ml64 -filetype=s /usr/local/google/home/thakis/src/llvm-project/llvm/test/tools/llvm-ml/strings_errors.asm /Fo /dev/null
+ /usr/local/google/home/thakis/src/llvm-project/out/gn/bin/FileCheck /usr/local/google/home/thakis/src/llvm-project/llvm/test/tools/llvm-ml/strings_errors.asm --implicit-check-not=error:
/usr/local/google/home/thakis/src/llvm-project/llvm/test/tools/llvm-ml/strings_errors.asm:9:10: error: CHECK: expected string not found in input
; CHECK: error: literal value out of range
         ^
<stdin>:1:1: note: scanning from here
error: unable to find `llvm-ml64' in PATH: No such file or directory
^
<stdin>:1:55: note: possible intended match here
error: unable to find `llvm-ml64' in PATH: No such file or directory
                                                      ^

Input file: <stdin>
Check file: /usr/local/google/home/thakis/src/llvm-project/llvm/test/tools/llvm-ml/strings_errors.asm

-dump-input=help explains the following input dump.

Input was:
<<<<<<
           1: error: unable to find `llvm-ml64' in PATH: No such file or directory 
check:9'0     X~~~~~~~~~~~~~~~~~~~~~~~~~~~~~~~~~~~~~~~~~~~~~~~~~~~~~~~~~~~~~~~~~~~~ error: no match found
check:9'1                                                           ?               possible intended match
>>>>>>

--

********************
Testing: 
FAIL: LLVM :: tools/llvm-ml/struct.asm (9 of 58674)
******************** TEST 'LLVM :: tools/llvm-ml/struct.asm' FAILED ********************
Exit Code: 2

Command Output (stderr):
--
RUN: at line 1: llvm-ml64 -filetype=s /usr/local/google/home/thakis/src/llvm-project/llvm/test/tools/llvm-ml/struct.asm /Fo - | /usr/local/google/home/thakis/src/llvm-project/out/gn/bin/FileCheck /usr/local/google/home/thakis/src/llvm-project/llvm/test/tools/llvm-ml/struct.asm
+ llvm-ml64 -filetype=s /usr/local/google/home/thakis/src/llvm-project/llvm/test/tools/llvm-ml/struct.asm /Fo -
/usr/local/google/home/thakis/src/llvm-project/out/gn/obj/llvm/test/tools/llvm-ml/Output/struct.asm.script: line 1: llvm-ml64: command not found
+ /usr/local/google/home/thakis/src/llvm-project/out/gn/bin/FileCheck /usr/local/google/home/thakis/src/llvm-project/llvm/test/tools/llvm-ml/struct.asm
FileCheck error: '<stdin>' is empty.
FileCheck command line:  /usr/local/google/home/thakis/src/llvm-project/out/gn/bin/FileCheck /usr/local/google/home/thakis/src/llvm-project/llvm/test/tools/llvm-ml/struct.asm

--

********************
Testing: 
FAIL: LLVM :: tools/llvm-ml/macro.asm (10 of 58674)
******************** TEST 'LLVM :: tools/llvm-ml/macro.asm' FAILED ********************
Exit Code: 2

Command Output (stderr):
--
RUN: at line 1: llvm-ml64 -filetype=s /usr/local/google/home/thakis/src/llvm-project/llvm/test/tools/llvm-ml/macro.asm /Fo - | /usr/local/google/home/thakis/src/llvm-project/out/gn/bin/FileCheck /usr/local/google/home/thakis/src/llvm-project/llvm/test/tools/llvm-ml/macro.asm
+ llvm-ml64 -filetype=s /usr/local/google/home/thakis/src/llvm-project/llvm/test/tools/llvm-ml/macro.asm /Fo -
/usr/local/google/home/thakis/src/llvm-project/out/gn/obj/llvm/test/tools/llvm-ml/Output/macro.asm.script: line 1: llvm-ml64: command not found
+ /usr/local/google/home/thakis/src/llvm-project/out/gn/bin/FileCheck /usr/local/google/home/thakis/src/llvm-project/llvm/test/tools/llvm-ml/macro.asm
FileCheck error: '<stdin>' is empty.
FileCheck command line:  /usr/local/google/home/thakis/src/llvm-project/out/gn/bin/FileCheck /usr/local/google/home/thakis/src/llvm-project/llvm/test/tools/llvm-ml/macro.asm

--

********************
Testing: 
FAIL: LLVM :: tools/llvm-ml/nested_proc.asm (11 of 58674)
******************** TEST 'LLVM :: tools/llvm-ml/nested_proc.asm' FAILED ********************
Exit Code: 2

Command Output (stderr):
--
RUN: at line 1: llvm-ml -filetype=s /usr/local/google/home/thakis/src/llvm-project/llvm/test/tools/llvm-ml/nested_proc.asm /Fo - | /usr/local/google/home/thakis/src/llvm-project/out/gn/bin/FileCheck /usr/local/google/home/thakis/src/llvm-project/llvm/test/tools/llvm-ml/nested_proc.asm
+ llvm-ml -filetype=s /usr/local/google/home/thakis/src/llvm-project/llvm/test/tools/llvm-ml/nested_proc.asm /Fo -
+ /usr/local/google/home/thakis/src/llvm-project/out/gn/bin/FileCheck /usr/local/google/home/thakis/src/llvm-project/llvm/test/tools/llvm-ml/nested_proc.asm
RUN: at line 2: llvm-ml64 -filetype=s /usr/local/google/home/thakis/src/llvm-project/llvm/test/tools/llvm-ml/nested_proc.asm /Fo - | /usr/local/google/home/thakis/src/llvm-project/out/gn/bin/FileCheck /usr/local/google/home/thakis/src/llvm-project/llvm/test/tools/llvm-ml/nested_proc.asm
+ llvm-ml64 -filetype=s /usr/local/google/home/thakis/src/llvm-project/llvm/test/tools/llvm-ml/nested_proc.asm /Fo -
/usr/local/google/home/thakis/src/llvm-project/out/gn/obj/llvm/test/tools/llvm-ml/Output/nested_proc.asm.script: line 2: llvm-ml64: command not found
+ /usr/local/google/home/thakis/src/llvm-project/out/gn/bin/FileCheck /usr/local/google/home/thakis/src/llvm-project/llvm/test/tools/llvm-ml/nested_proc.asm
FileCheck error: '<stdin>' is empty.
FileCheck command line:  /usr/local/google/home/thakis/src/llvm-project/out/gn/bin/FileCheck /usr/local/google/home/thakis/src/llvm-project/llvm/test/tools/llvm-ml/nested_proc.asm

--

********************
Testing: 
FAIL: LLVM :: tools/llvm-ml/proc_frame.asm (12 of 58674)
******************** TEST 'LLVM :: tools/llvm-ml/proc_frame.asm' FAILED ********************
Exit Code: 2

Command Output (stderr):
--
RUN: at line 1: llvm-ml64 -filetype=s /usr/local/google/home/thakis/src/llvm-project/llvm/test/tools/llvm-ml/proc_frame.asm /Fo - | /usr/local/google/home/thakis/src/llvm-project/out/gn/bin/FileCheck /usr/local/google/home/thakis/src/llvm-project/llvm/test/tools/llvm-ml/proc_frame.asm
+ llvm-ml64 -filetype=s /usr/local/google/home/thakis/src/llvm-project/llvm/test/tools/llvm-ml/proc_frame.asm /Fo -
/usr/local/google/home/thakis/src/llvm-project/out/gn/obj/llvm/test/tools/llvm-ml/Output/proc_frame.asm.script: line 1: llvm-ml64: command not found
+ /usr/local/google/home/thakis/src/llvm-project/out/gn/bin/FileCheck /usr/local/google/home/thakis/src/llvm-project/llvm/test/tools/llvm-ml/proc_frame.asm
FileCheck error: '<stdin>' is empty.
FileCheck command line:  /usr/local/google/home/thakis/src/llvm-project/out/gn/bin/FileCheck /usr/local/google/home/thakis/src/llvm-project/llvm/test/tools/llvm-ml/proc_frame.asm

--

********************
Testing: 
FAIL: LLVM :: tools/llvm-ml/extern.asm (13 of 58674)
******************** TEST 'LLVM :: tools/llvm-ml/extern.asm' FAILED ********************
Exit Code: 2

Command Output (stderr):
--
RUN: at line 1: llvm-ml -filetype=s /usr/local/google/home/thakis/src/llvm-project/llvm/test/tools/llvm-ml/extern.asm /Fo - | /usr/local/google/home/thakis/src/llvm-project/out/gn/bin/FileCheck /usr/local/google/home/thakis/src/llvm-project/llvm/test/tools/llvm-ml/extern.asm --check-prefixes=CHECK,CHECK-32
+ llvm-ml -filetype=s /usr/local/google/home/thakis/src/llvm-project/llvm/test/tools/llvm-ml/extern.asm /Fo -
+ /usr/local/google/home/thakis/src/llvm-project/out/gn/bin/FileCheck /usr/local/google/home/thakis/src/llvm-project/llvm/test/tools/llvm-ml/extern.asm --check-prefixes=CHECK,CHECK-32
RUN: at line 2: llvm-ml64 -filetype=s /usr/local/google/home/thakis/src/llvm-project/llvm/test/tools/llvm-ml/extern.asm /Fo - | /usr/local/google/home/thakis/src/llvm-project/out/gn/bin/FileCheck /usr/local/google/home/thakis/src/llvm-project/llvm/test/tools/llvm-ml/extern.asm --check-prefixes=CHECK,CHECK-64
+ llvm-ml64 -filetype=s /usr/local/google/home/thakis/src/llvm-project/llvm/test/tools/llvm-ml/extern.asm /Fo -
/usr/local/google/home/thakis/src/llvm-project/out/gn/obj/llvm/test/tools/llvm-ml/Output/extern.asm.script: line 2: llvm-ml64: command not found
+ /usr/local/google/home/thakis/src/llvm-project/out/gn/bin/FileCheck /usr/local/google/home/thakis/src/llvm-project/llvm/test/tools/llvm-ml/extern.asm --check-prefixes=CHECK,CHECK-64
FileCheck error: '<stdin>' is empty.
FileCheck command line:  /usr/local/google/home/thakis/src/llvm-project/out/gn/bin/FileCheck /usr/local/google/home/thakis/src/llvm-project/llvm/test/tools/llvm-ml/extern.asm --check-prefixes=CHECK,CHECK-64

--

********************
Testing: 
FAIL: LLVM :: tools/llvm-ml/dot_operator.asm (14 of 58674)
******************** TEST 'LLVM :: tools/llvm-ml/dot_operator.asm' FAILED ********************
Exit Code: 2

Command Output (stderr):
--
RUN: at line 1: llvm-ml64 -filetype=s /usr/local/google/home/thakis/src/llvm-project/llvm/test/tools/llvm-ml/dot_operator.asm /Fo - | /usr/local/google/home/thakis/src/llvm-project/out/gn/bin/FileCheck /usr/local/google/home/thakis/src/llvm-project/llvm/test/tools/llvm-ml/dot_operator.asm
+ llvm-ml64 -filetype=s /usr/local/google/home/thakis/src/llvm-project/llvm/test/tools/llvm-ml/dot_operator.asm /Fo -
/usr/local/google/home/thakis/src/llvm-project/out/gn/obj/llvm/test/tools/llvm-ml/Output/dot_operator.asm.script: line 1: llvm-ml64: command not found
+ /usr/local/google/home/thakis/src/llvm-project/out/gn/bin/FileCheck /usr/local/google/home/thakis/src/llvm-project/llvm/test/tools/llvm-ml/dot_operator.asm
FileCheck error: '<stdin>' is empty.
FileCheck command line:  /usr/local/google/home/thakis/src/llvm-project/out/gn/bin/FileCheck /usr/local/google/home/thakis/src/llvm-project/llvm/test/tools/llvm-ml/dot_operator.asm

--

********************
Testing: 
FAIL: LLVM :: tools/llvm-ml/repeat_directives.asm (15 of 58674)
******************** TEST 'LLVM :: tools/llvm-ml/repeat_directives.asm' FAILED ********************
Exit Code: 2

Command Output (stderr):
--
RUN: at line 1: llvm-ml64 -filetype=s /usr/local/google/home/thakis/src/llvm-project/llvm/test/tools/llvm-ml/repeat_directives.asm /Fo - | /usr/local/google/home/thakis/src/llvm-project/out/gn/bin/FileCheck /usr/local/google/home/thakis/src/llvm-project/llvm/test/tools/llvm-ml/repeat_directives.asm
+ llvm-ml64 -filetype=s /usr/local/google/home/thakis/src/llvm-project/llvm/test/tools/llvm-ml/repeat_directives.asm /Fo -
/usr/local/google/home/thakis/src/llvm-project/out/gn/obj/llvm/test/tools/llvm-ml/Output/repeat_directives.asm.script: line 1: llvm-ml64: command not found
+ /usr/local/google/home/thakis/src/llvm-project/out/gn/bin/FileCheck /usr/local/google/home/thakis/src/llvm-project/llvm/test/tools/llvm-ml/repeat_directives.asm
FileCheck error: '<stdin>' is empty.
FileCheck command line:  /usr/local/google/home/thakis/src/llvm-project/out/gn/bin/FileCheck /usr/local/google/home/thakis/src/llvm-project/llvm/test/tools/llvm-ml/repeat_directives.asm

--

********************
Testing:  0.. 10.. 20.. 30.. 40.. 50.. 60.. 70.. 80.. 90.. 
********************
Failed Tests (15):
  LLVM :: tools/llvm-ml/architecture.asm
  LLVM :: tools/llvm-ml/architecture_errors.asm
  LLVM :: tools/llvm-ml/dot_operator.asm
  LLVM :: tools/llvm-ml/extern.asm
  LLVM :: tools/llvm-ml/feat00.asm
  LLVM :: tools/llvm-ml/feat00_override.asm
  LLVM :: tools/llvm-ml/indirect_branch.asm
  LLVM :: tools/llvm-ml/macro.asm
  LLVM :: tools/llvm-ml/nested_proc.asm
  LLVM :: tools/llvm-ml/proc.asm
  LLVM :: tools/llvm-ml/proc_frame.asm
  LLVM :: tools/llvm-ml/repeat_directives.asm
  LLVM :: tools/llvm-ml/rip_relative_addressing.asm
  LLVM :: tools/llvm-ml/strings_errors.asm
  LLVM :: tools/llvm-ml/struct.asm


Testing Time: 155.42s

Total Discovered Tests: 64607
  Skipped          :    16 (0.02%)
  Unsupported      :  2108 (3.26%)
  Passed           : 62292 (96.42%)
  Expectedly Failed:   176 (0.27%)
  Failed           :    15 (0.02%)
FAILED: gen/llvm/test/run-lit 
python3 bin/llvm-lit -sv ../../llvm/test
ninja: build stopped: subcommand failed.
Command '['ninja', '-C', 'out/gn', 'check-llvm']' returned non-zero exit status 1.