INFO:2025-03-19T20:52:25Z:root:pulling...
From github.com:llvm/llvm-project
 * branch                      main       -> FETCH_HEAD
   0f7bd60791ed..0668bb28cc98  main       -> origin/main
Switched to branch 'main'
Your branch is behind 'origin/main' by 2 commits, and can be fast-forwarded.
  (use "git pull" to update your local branch)
HEAD is now at 0668bb28cc98 [ctxprof] Track unhandled call targets (#131417)
INFO:2025-03-19T20:52:28Z:root:syncing...
Deleted branch merge (was 0f7bd60791ed).
Switched to a new branch 'merge'
branch 'merge' set up to track 'origin/main'.
INFO:2025-03-19T20:52:28Z:root:building
ninja: Entering directory `out/gn'
[1/532] CXX obj/llvm/tools/llvm-ctxprof-util/llvm-ctxprof-util.llvm-ctxprof-util.o
[2/532] CXX obj/llvm/lib/ProfileData/ProfileData.PGOCtxProfReader.o
[3/532] CXX obj/llvm/lib/ProfileData/ProfileData.PGOCtxProfWriter.o
[4/532] AR lib/libLLVMProfileData.a
[5/532] LINK obj/llvm/unittests/tools/llvm-profdata/LLVMProfdataTests
[6/532] LINK ./bin/llvm-ctxprof-util
[7/532] CXX obj/llvm/lib/Transforms/IPO/IPO.ElimAvailExtern.o
[8/532] LINK ./bin/llvm-profdata
[9/532] LINK ./bin/llvm-cov
[10/532] CXX obj/llvm/lib/Transforms/Utils/Utils.CallPromotionUtils.o
[11/532] CXX obj/llvm/lib/Analysis/Analysis.CtxProfAnalysis.o
[12/532] AR lib/libLLVMAnalysis.a
[13/532] CXX obj/llvm/unittests/ProfileData/ProfileDataTests.PGOCtxProfReaderWriterTest.o
[14/532] LINK ./bin/llvm-stress
[15/532] LINK ./bin/llvm-sim
[16/532] LINK ./bin/llvm-tli-checker
[17/532] CXX obj/llvm/lib/Transforms/IPO/IPO.ModuleInliner.o
[18/532] LINK obj/llvm/unittests/SandboxIR/SandboxIRTests
[19/532] LINK obj/llvm/unittests/ProfileData/ProfileDataTests
[20/532] CXX obj/llvm/lib/Transforms/Instrumentation/Instrumentation.PGOCtxProfLowering.o
[21/532] CXX obj/llvm/lib/Transforms/Instrumentation/Instrumentation.PGOCtxProfFlattening.o
[22/532] CXX obj/llvm/unittests/Transforms/Utils/UtilsTests.CallPromotionUtilsTest.o
[23/532] CXX obj/llvm/lib/Transforms/IPO/IPO.Inliner.o
[24/532] CXX obj/llvm/lib/Transforms/Instrumentation/Instrumentation.IndirectCallPromotion.o
[25/532] CXX obj/llvm/lib/Transforms/IPO/IPO.FunctionImport.o
[26/532] CXX obj/llvm/unittests/Analysis/AnalysisTests.CtxProfAnalysisTest.o
[27/532] CXX obj/llvm/lib/Transforms/Utils/Utils.InlineFunction.o
[28/532] AR lib/libLLVMTransformUtils.a
[29/532] LINK obj/llvm/unittests/DWARFLinkerParallel/DWARFLinkerParallelTests
[30/532] LINK obj/clang/unittests/InstallAPI/InstallAPITests
[31/532] LINK obj/llvm/unittests/Linker/LinkerTests
[32/532] LINK ./bin/clang-offload-bundler
[33/532] LINK ./bin/verify-uselistorder
[34/532] LINK ./bin/llvm-modextract
[35/532] LINK ./bin/clang-apply-replacements
[36/532] LINK obj/llvm/unittests/Bitcode/BitcodeTests
[37/532] LINK obj/clang/unittests/Format/FormatTests
[38/532] LINK ./bin/llvm-as
[39/532] LINK obj/clang-tools-extra/unittests/clang-apply-replacements/ClangApplyReplacementsTests
[40/532] LINK ./bin/llvm-cat
[41/532] LINK obj/llvm/unittests/FuzzMutate/FuzzMutateTests
[42/532] LINK ./bin/llvm-cgdata
[43/532] LINK obj/bolt/unittests/Profile/ProfileTests
[44/532] LINK ./bin/llvm-bat-dump
[45/532] LINK ./bin/sancov
[46/532] LINK obj/llvm/unittests/MC/SystemZ/SystemZAsmLexerTests
[47/532] LINK ./bin/llvm-mca
[48/532] LINK ./bin/llvm-nm
[49/532] LINK ./bin/llvm-debuginfo-analyzer
[50/532] STAMP obj/llvm/tools/llvm-nm/symlinks.stamp
[51/532] LINK ./bin/llvm-dwarfdump
[52/532] LINK ./bin/llvm-objdump
[53/532] LINK ./bin/llvm-cfi-verify
[54/532] LINK obj/clang/unittests/Rewrite/RewriteTests
[55/532] LINK obj/clang/unittests/Support/ClangSupportTests
[56/532] LINK ./bin/clang-include-fixer
[57/532] LINK obj/llvm/unittests/Transforms/Vectorize/SandboxVectorizer/SandboxVectorizerTests
[58/532] ACTION //llvm/tools/llvm-objdump:llvm-otool(//llvm/utils/gn/build/toolchain:unix)
[59/532] STAMP obj/llvm/tools/llvm-objdump/llvm-otool.stamp
[60/532] STAMP obj/llvm/tools/llvm-objdump/symlinks.stamp
[61/532] LINK obj/clang-tools-extra/unittests/clang-doc/ClangDocTests
[62/532] LINK obj/clang-tools-extra/unittests/clang-include-fixer/ClangIncludeFixerTests
[63/532] LINK ./bin/clang-change-namespace
[64/532] LINK obj/clang/unittests/AST/ByteCode/InterpTests
[65/532] LINK obj/llvm/unittests/Transforms/Vectorize/VectorizeTests
[66/532] LINK ./bin/clang-query
[67/532] LINK obj/clang-tools-extra/unittests/clang-change-namespace/ClangChangeNamespaceTests
[68/532] LINK ./bin/clang-refactor
[69/532] LINK ./bin/pp-trace
[70/532] LINK ./bin/clang-installapi
[71/532] LINK obj/clang/unittests/Sema/SemaTests
[72/532] LINK obj/clang/unittests/Lex/LexTests
[73/532] LINK ./bin/modularize
[74/532] LINK obj/clang/unittests/Analysis/FlowSensitive/ClangAnalysisFlowSensitiveTests
[75/532] LINK ./bin/clang-doc
[76/532] LINK obj/clang/unittests/Analysis/ClangAnalysisTests
[77/532] LINK ./bin/clang-diff
[78/532] LINK ./bin/clang-move
[79/532] LINK obj/clang-tools-extra/unittests/clang-include-fixer/find-all-symbols/FindAllSymbolsTests
[80/532] LINK obj/llvm/unittests/Target/PowerPC/PowerPCTests
[81/532] LINK ./bin/clang-reorder-fields
[82/532] LINK obj/clang/unittests/Serialization/SerializationTests
[83/532] LINK obj/clang/unittests/ASTMatchers/Dynamic/DynamicASTMatchersTests
[84/532] LINK ./bin/find-all-symbols
[85/532] LINK obj/clang-tools-extra/unittests/clang-query/ClangQueryTests
[86/532] LINK obj/clang/unittests/AST/ASTTests
[87/532] LINK obj/llvm/unittests/Target/LoongArch/LoongArchTests
[88/532] LINK obj/clang/unittests/ASTMatchers/ASTMatchersTests
[89/532] LINK ./bin/diagtool
[90/532] LINK obj/clang/unittests/Index/IndexTests
[91/532] LINK obj/clang/unittests/StaticAnalyzer/StaticAnalysisTests
[92/532] LINK obj/clang-tools-extra/unittests/clang-move/ClangMoveTests
[93/532] LINK obj/clang-tools-extra/unittests/clang-tidy/ClangTidyTests
[94/532] STAMP obj/clang-tools-extra/unittests/unittests.stamp
[95/532] LINK obj/llvm/unittests/Target/AArch64/AArch64Tests
[96/532] LINK obj/llvm/unittests/tools/llvm-cfi-verify/CFIVerifyTests
[97/532] LINK obj/llvm/unittests/Target/WebAssembly/WebAssemblyTests
[98/532] LINK ./bin/clang-extdef-mapping
[99/532] LINK ./bin/clang-tidy
[100/532] CXX obj/llvm/lib/Transforms/Instrumentation/Instrumentation.PGOInstrumentation.o
[101/532] AR lib/libLLVMInstrumentation.a
[102/532] LINK obj/llvm/unittests/MC/X86/X86MCTests
[103/532] CXX obj/llvm/lib/Transforms/IPO/IPO.WholeProgramDevirt.o
[104/532] LINK obj/llvm/unittests/tools/llvm-mca/LLVMMCATests
[105/532] CXX obj/llvm/lib/Transforms/IPO/IPO.SampleProfile.o
[106/532] CXX obj/clang/lib/CodeGen/CodeGen.CoverageMappingGen.o
[107/532] CXX obj/llvm/lib/Passes/Passes.PassBuilderPipelines.o
[108/532] CXX obj/llvm/lib/Transforms/IPO/IPO.MemProfContextDisambiguation.o
[109/532] CXX obj/llvm/lib/Transforms/IPO/IPO.AttributorAttributes.o
[110/532] AR lib/libLLVMipo.a
[111/532] LINK ./bin/llvm-link
[112/532] LINK obj/llvm/unittests/Transforms/IPO/IPOTests
[113/532] LINK obj/llvm/unittests/Target/ARM/ARMTests
[114/532] LINK obj/llvm/unittests/Target/RISCV/RISCVTests
[115/532] LINK ./bin/llvm-profgen
[116/532] CXX obj/llvm/lib/Passes/Passes.PassBuilder.o
[117/532] AR lib/libLLVMPasses.a
[118/532] AR lib/libclangCodeGen.a
[119/532] LINK ./bin/lli-child-target
[120/532] LINK ./bin/llvm-cxxmap
[121/532] LINK obj/llvm/unittests/CGData/CodeGenDataTests
[122/532] LINK obj/llvm/unittests/ExecutionEngine/ExecutionEngineTests
[123/532] LINK ./bin/llvm-cxxdump
[124/532] LINK ./bin/clang-offload-packager
[125/532] LINK obj/llvm/unittests/DebugInfo/GSYM/DebugInfoGSYMTests
[126/532] LINK ./bin/llvm-xray
[127/532] LINK obj/llvm/unittests/ExecutionEngine/JITLink/JITLinkTests
[128/532] LINK ./bin/llvm-extract
[129/532] LINK ./bin/llvm-libtool-darwin
[130/532] LINK ./bin/llvm-rtdyld
[131/532] LINK obj/llvm/unittests/Transforms/Coroutines/CoroTests
[132/532] LINK obj/llvm/unittests/IR/IRTests
[133/532] LINK ./bin/llvm-ml
[134/532] STAMP obj/llvm/tools/llvm-libtool-darwin/symlinks.stamp
[135/532] LINK obj/llvm/unittests/tools/llvm-exegesis/RISCV/LLVMExegesisRISCVTests
[136/532] LINK obj/llvm/unittests/MC/MCTests
[137/532] LINK ./bin/llvm-ar
[138/532] LINK ./bin/llvm-lipo
[139/532] LINK ./bin/llvm-mc
[140/532] LINK obj/llvm/unittests/Frontend/LLVMFrontendTests
[141/532] LINK obj/llvm/unittests/ExecutionEngine/Orc/OrcJITTests
[142/532] LINK obj/llvm/unittests/Analysis/AnalysisTests
[143/532] STAMP obj/llvm/tools/llvm-lipo/symlinks.stamp
[144/532] ACTION //llvm/tools/llvm-ar:llvm-lib(//llvm/utils/gn/build/toolchain:unix)
[145/532] STAMP obj/llvm/tools/llvm-ar/llvm-lib.stamp
[146/532] ACTION //llvm/tools/llvm-ar:llvm-ranlib(//llvm/utils/gn/build/toolchain:unix)
[147/532] STAMP obj/llvm/tools/llvm-ar/llvm-ranlib.stamp
[148/532] LINK ./bin/lli
[149/532] ACTION //llvm/tools/llvm-ar:llvm-dlltool(//llvm/utils/gn/build/toolchain:unix)
[150/532] STAMP obj/llvm/tools/llvm-ar/llvm-dlltool.stamp
[151/532] STAMP obj/llvm/tools/llvm-ar/symlinks.stamp
[152/532] STAMP obj/llvm-ar.stamp
[153/532] LINK obj/llvm/unittests/Passes/Plugins/PluginsTests
[154/532] LINK obj/bolt/unittests/Core/CoreTests
[155/532] STAMP obj/bolt/unittests/unittests.stamp
[156/532] LINK obj/clang/unittests/Tooling/Syntax/SyntaxTests
[157/532] LINK obj/llvm/unittests/MC/AMDGPU/AMDGPUMCTests
[158/532] LINK obj/llvm/unittests/Passes/PassBuilderBindings/PassesBindingsTests
[159/532] LINK obj/llvm/unittests/ExecutionEngine/MCJIT/MCJITTests
[160/532] LINK ./bin/llvm-exegesis
[161/532] LINK obj/clang/unittests/CrossTU/CrossTUTests
[162/532] LINK ./bin/llvm-jitlink
[163/532] LINK ./bin/llvm-bolt-heatmap
[164/532] LINK ./bin/llvm-bolt
[165/532] LINK obj/llvm/unittests/DebugInfo/LogicalView/DebugInfoLogicalViewTests
[166/532] LINK obj/clang/unittests/CodeGen/ClangCodeGenTests
[167/532] LINK ./bin/llvm-lto2
[168/532] LINK ./bin/clang-nvlink-wrapper
[169/532] LINK ./bin/lld
[170/532] LINK ./bin/dsymutil
[171/532] LINK obj/llvm/unittests/CodeGen/GlobalISel/GlobalISelTests
[172/532] LINK ./bin/llvm-isel-fuzzer
[173/532] ACTION //bolt/tools/driver:llvm-boltdiff(//llvm/utils/gn/build/toolchain:unix)
[174/532] STAMP obj/bolt/tools/driver/llvm-boltdiff.stamp
[175/532] ACTION //bolt/tools/driver:perf2bolt(//llvm/utils/gn/build/toolchain:unix)
[176/532] LINK ./bin/llvm-lto
[177/532] STAMP obj/bolt/tools/driver/perf2bolt.stamp
[178/532] STAMP obj/bolt/tools/driver/symlinks.stamp
[179/532] ACTION //lld/tools/lld:wasm-ld(//llvm/utils/gn/build/toolchain:unix)
[180/532] STAMP obj/lld/tools/lld/wasm-ld.stamp
[181/532] ACTION //lld/tools/lld:ld.lld(//llvm/utils/gn/build/toolchain:unix)
[182/532] LINK ./bin/llvm-split
[183/532] STAMP obj/lld/tools/lld/ld.lld.stamp
[184/532] LINK ./bin/llvm-dwp
[185/532] ACTION //lld/tools/lld:ld64.lld(//llvm/utils/gn/build/toolchain:unix)
[186/532] ACTION //lld/tools/lld:lld-link(//llvm/utils/gn/build/toolchain:unix)
[187/532] STAMP obj/lld/tools/lld/ld64.lld.stamp
[188/532] STAMP obj/lld/tools/lld/lld-link.stamp
[189/532] STAMP obj/lld/tools/lld/symlinks.stamp
[190/532] STAMP obj/lld.stamp
[191/532] LINK ./bin/llvm-opt-fuzzer
[192/532] LINK ./bin/llvm-reduce
[193/532] LINK ./bin/clang-linker-wrapper
[194/532] LINK obj/llvm/unittests/DebugInfo/DWARF/DebugInfoDWARFTests
[195/532] LINK obj/llvm/unittests/Target/TargetMachineCTests
[196/532] LINK obj/llvm/unittests/CodeGen/CodeGenTests
[197/532] LINK obj/llvm/unittests/tools/llvm-exegesis/LLVMExegesisTests
[198/532] LINK ./bin/bugpoint
[199/532] LINK obj/llvm/unittests/Transforms/Utils/UtilsTests
[200/532] LINK obj/llvm/unittests/tools/llvm-exegesis/PowerPC/LLVMExegesisPowerPCTests
[201/532] LINK obj/llvm/unittests/tools/llvm-exegesis/Mips/LLVMExegesisMipsTests
[202/532] LINK obj/llvm/unittests/Transforms/Instrumentation/InstrumentationTests
[203/532] LINK obj/llvm/unittests/Transforms/Scalar/ScalarTests
[204/532] LINK obj/lld/unittests/AsLibAll/LLDAsLibAllTests
[205/532] LINK ./bin/llvm-gsymutil
[206/532] LINK obj/llvm/unittests/MI/MITests
[207/532] LINK obj/llvm/unittests/tools/llvm-exegesis/AArch64/LLVMExegesisAArch64Tests
[208/532] LINK obj/llvm/unittests/Target/X86/X86Tests
[209/532] LINK obj/llvm/unittests/MIR/MIRTests
[210/532] SOLINK ./lib/libLTO.so
[211/532] LINK ./bin/llvm-dwarfutil
[212/532] LINK obj/llvm/unittests/Target/AMDGPU/AMDGPUTests
[213/532] LINK obj/llvm/unittests/tools/llvm-exegesis/X86/LLVMExegesisX86Tests
[214/532] STAMP obj/llvm/unittests/unittests.stamp
[215/532] LINK ./bin/clang-scan-deps
[216/532] LINK ./bin/dexp
[217/532] LINK ./bin/opt
[218/532] LINK ./bin/clang-import-test
[219/532] LINK ./bin/llvm-c-test
[220/532] LINK ./bin/llc
[221/532] STAMP obj/llvm/test/test.stamp
[222/532] LINK ./bin/clangd-indexer
[223/532] LINK obj/lld/unittests/AsLibELF/LLDAsLibELFTests
[224/532] STAMP obj/lld/unittests/unittests.stamp
[225/532] STAMP obj/lld/test/test.stamp
[226/532] LINK ./bin/clangd
[227/532] LINK obj/clang/unittests/Frontend/FrontendTests
[228/532] LINK obj/clang-tools-extra/clangd/unittests/ClangdTests
[229/532] STAMP obj/clang-tools-extra/clangd/test/test.stamp
[230/532] LINK ./bin/lldb-server
[231/532] LINK obj/clang/unittests/Interpreter/ExceptionTests/ClangReplInterpreterExceptionTests
[232/532] LINK obj/clang/unittests/Driver/ClangDriverTests
[233/532] LINK ./bin/clang-check
[234/532] SOLINK ./lib/libclang.so
[235/532] LINK obj/clang/unittests/libclang/CrashTests/libclangCrashTests
[236/532] LINK obj/clang/unittests/libclang/libclangTests
[237/532] LINK obj/clang/unittests/Interpreter/ClangReplInterpreterTests
[238/532] LINK ./bin/clang-repl
[239/532] LINK obj/clang/unittests/Tooling/ToolingTests
[240/532] STAMP obj/clang/unittests/unittests.stamp
[241/532] LINK ./bin/c-index-test
[242/532] LINK ./bin/clang
[243/532] LINK ./bin/lldb-test
[244/532] LINK ./bin/lldb-dap
[245/532] ACTION //clang/tools/driver:clangxx(//llvm/utils/gn/build/toolchain:unix)
[246/532] ACTION //clang/tools/driver:clang-cl(//llvm/utils/gn/build/toolchain:unix)
[247/532] ACTION //clang/tools/driver:clang-cpp(//llvm/utils/gn/build/toolchain:unix)
[248/532] STAMP obj/clang/tools/driver/clangxx.stamp
[249/532] STAMP obj/clang/tools/driver/clang-cl.stamp
[250/532] STAMP obj/clang/tools/driver/clang-cpp.stamp
[251/532] STAMP obj/clang/tools/driver/symlinks.stamp
[252/532] STAMP obj/clang.stamp
[253/532] STAMP obj/bolt/test/test.stamp
[254/532] STAMP obj/clang-tools-extra/test/test.stamp
[255/532] STAMP obj/clang/test/test.stamp
[256/532] STAMP stage2_baremetal_aarch64/obj/compiler-rt/lib/builtins/builtins.inputdeps.stamp
[257/532] STAMP stage2_unix/obj/compiler-rt/lib/asan/asan_shared_library.inputdeps.stamp
[258/532] STAMP stage2_unix/obj/compiler-rt/lib/asan/asan_static_library.inputdeps.stamp
[259/532] STAMP stage2_unix/obj/compiler-rt/lib/builtins/builtins.inputdeps.stamp
[260/532] STAMP stage2_unix/obj/compiler-rt/lib/asan/static_sources.inputdeps.stamp
[261/532] STAMP stage2_unix/obj/compiler-rt/lib/profile/profile.inputdeps.stamp
[262/532] STAMP stage2_unix/obj/compiler-rt/lib/hwasan/sources.inputdeps.stamp
[263/532] STAMP stage2_unix/obj/compiler-rt/lib/msan/msan.inputdeps.stamp
[264/532] STAMP stage2_unix/obj/compiler-rt/lib/interception/sources.inputdeps.stamp
[265/532] STAMP stage2_unix/obj/compiler-rt/lib/lsan/common_sources.inputdeps.stamp
[266/532] STAMP stage2_unix/obj/compiler-rt/lib/sanitizer_common/sources.inputdeps.stamp
[267/532] STAMP stage2_unix/obj/libcxx/src/cxx_experimental.inputdeps.stamp
[268/532] STAMP stage2_unix/obj/compiler-rt/lib/scudo/standalone/sources.inputdeps.stamp
[269/532] STAMP stage2_unix/obj/compiler-rt/lib/tsan/rtl/rtl.inputdeps.stamp
[270/532] STAMP stage2_unix/obj/libcxx/src/cxx_shared.inputdeps.stamp
[271/532] STAMP stage2_unix/obj/compiler-rt/lib/ubsan/sources.inputdeps.stamp
[272/532] STAMP stage2_unix/obj/compiler-rt/lib/ubsan/standalone_sources.inputdeps.stamp
[273/532] STAMP stage2_unix/obj/compiler-rt/lib/ubsan/cxx_sources.inputdeps.stamp
[274/532] STAMP stage2_unix/obj/libcxxabi/src/cxxabi_static.inputdeps.stamp
[275/532] STAMP stage2_unix/obj/libcxx/src/cxx_static.inputdeps.stamp
[276/532] STAMP stage2_unix/obj/libcxxabi/src/cxxabi_shared.inputdeps.stamp
[277/532] STAMP stage2_unix/obj/libunwind/src/unwind_static.inputdeps.stamp
[278/532] STAMP stage2_unix/obj/libunwind/src/unwind_shared.inputdeps.stamp
[279/532] STAMP stage2_unix/obj/libunwind/src/unwind_static_exported.inputdeps.stamp
[280/532] STAMP stage2_unix/obj/llvm/lib/Demangle/Demangle.inputdeps.stamp
[281/532] ACTION //compiler-rt/test/asan:lit_site_cfg(//llvm/utils/gn/build/toolchain:stage2_unix)
[282/531] ACTION //compiler-rt/test/hwasan:lit_site_cfg(//llvm/utils/gn/build/toolchain:stage2_unix)
[283/530] ACTION //compiler-rt/test/lsan:asan_mode_cfg(//llvm/utils/gn/build/toolchain:stage2_unix)
[284/529] ACTION //compiler-rt/test:lit_common_configured(//llvm/utils/gn/build/toolchain:stage2_unix)
[285/526] ACTION //llvm/include/llvm/Config:AsmParsers.def(//llvm/utils/gn/build/toolchain:stage2_unix)
[286/525] ACTION //llvm/include/llvm/Config:Disassemblers.def(//llvm/utils/gn/build/toolchain:stage2_unix)
[287/524] ACTION //llvm/include/llvm/Config:TargetExegesis.def(//llvm/utils/gn/build/toolchain:stage2_unix)
[288/523] ACTION //llvm/include/llvm/Config:abi-breaking(//llvm/utils/gn/build/toolchain:stage2_unix)
[289/521] ACTION //llvm/include/llvm/Config:Targets.def(//llvm/utils/gn/build/toolchain:stage2_unix)
[290/520] ACTION //llvm/include/llvm/Support:write_extension_def(//llvm/utils/gn/build/toolchain:stage2_unix)
[291/519] STAMP stage2_unix/obj/compiler-rt/test/asan/asan_toolchain.stamp
[292/519] ACTION //llvm/include/llvm/Config:TargetMCAs.def(//llvm/utils/gn/build/toolchain:stage2_unix)
[293/518] ACTION //llvm/include/llvm/Config:llvm-config(//llvm/utils/gn/build/toolchain:stage2_unix)
[294/359] ACTION //llvm/include/llvm/Config:AsmPrinters.def(//llvm/utils/gn/build/toolchain:stage2_unix)
[295/357] ACTION //libcxx/src:cxx_symlink(//llvm/utils/gn/build/toolchain:stage2_unix)
[296/357] STAMP obj/compiler-rt/test/asan/asan.stamp
[297/357] ACTION //llvm/include/llvm/Support:write_vcsrevision(//llvm/utils/gn/build/toolchain:stage2_unix)
[298/356] STAMP stage2_unix/obj/llvm/lib/Support/BLAKE3/BLAKE3.inputdeps.stamp
[299/356] STAMP stage2_unix/obj/libcxx/src/cxx_symlink.stamp
[300/356] ACTION //llvm/include/llvm/Config:config(//llvm/utils/gn/build/toolchain:stage2_unix)
[301/323] ACTION //libcxx/src:cxx_linker_script(//llvm/utils/gn/build/toolchain:stage2_unix)
[302/323] STAMP stage2_unix/obj/compiler-rt/lib/scudo/standalone/tests/ScudoCxxUnitTest.inputdeps.stamp
[303/323] STAMP stage2_unix/obj/compiler-rt/lib/scudo/standalone/tests/ScudoCUnitTest.inputdeps.stamp
[304/323] STAMP stage2_unix/obj/compiler-rt/lib/scudo/standalone/tests/ScudoUnitTest.inputdeps.stamp
[305/323] STAMP stage2_unix/obj/llvm/lib/Support/Support.inputdeps.stamp
[306/323] STAMP stage2_unix/obj/third-party/unittest/gtest.inputdeps.stamp
[307/323] STAMP stage2_unix/obj/libcxx/src/cxx_linker_script.stamp
[308/323] LINK ./bin/lldb
[309/323] STAMP stage2_unix/obj/libcxx/src/src.stamp
[310/323] STAMP obj/lldb/test/test.stamp
[311/323] STAMP obj/libcxx/libcxx.stamp
[312/323] ACTION //compiler-rt/lib/ubsan:version_script(//llvm/utils/gn/build/toolchain:stage2_unix)
[313/323] STAMP stage2_unix/obj/compiler-rt/lib/ubsan/version_script.stamp
[314/323] ACTION //compiler-rt/lib/hwasan:version_script(//llvm/utils/gn/build/toolchain:stage2_unix)
[315/323] STAMP stage2_unix/obj/compiler-rt/lib/hwasan/version_script.stamp
[316/323] SOLINK lib/clang/21/lib/linux/libclang_rt.ubsan_standalone-x86_64.so
[317/323] STAMP stage2_unix/obj/compiler-rt/lib/ubsan/ubsan.stamp
[318/323] STAMP stage2_unix/obj/compiler-rt/lib/lib.stamp
[319/323] STAMP obj/compiler-rt/compiler-rt.stamp
[320/323] SOLINK lib/clang/21/lib/linux/libclang_rt.hwasan_aliases-x86_64.so
[321/323] STAMP stage2_unix/obj/compiler-rt/test/hwasan/hwasan_toolchain.stamp
[322/323] STAMP obj/compiler-rt/test/hwasan/hwasan.stamp
[323/323] STAMP obj/default.stamp
INFO:2025-03-19T20:53:29Z:root:analyze
skipping analyze because previous build was not green
INFO:2025-03-19T20:53:29Z:root:testing
INFO:2025-03-19T20:53:29Z:root:test check-clang
ninja: Entering directory `out/gn'
[0/2] ACTION //clang/test:check-clang(//llvm/utils/gn/build/toolchain:unix)
llvm-lit: /usr/local/google/home/thakis/src/llvm-project/llvm/utils/lit/lit/llvm/config.py:520: note: using clang: /usr/local/google/home/thakis/src/llvm-project/out/gn/bin/clang
llvm-lit: /usr/local/google/home/thakis/src/llvm-project/llvm/utils/lit/lit/llvm/subst.py:126: note: Did not find cir-opt in /usr/local/google/home/thakis/src/llvm-project/out/gn/bin:/usr/local/google/home/thakis/src/llvm-project/out/gn/bin
llvm-lit: /usr/local/google/home/thakis/src/llvm-project/llvm/utils/lit/lit/llvm/config.py:520: note: using ld.lld: /usr/local/google/home/thakis/src/llvm-project/out/gn/bin/ld.lld
llvm-lit: /usr/local/google/home/thakis/src/llvm-project/llvm/utils/lit/lit/llvm/config.py:520: note: using lld-link: /usr/local/google/home/thakis/src/llvm-project/out/gn/bin/lld-link
llvm-lit: /usr/local/google/home/thakis/src/llvm-project/llvm/utils/lit/lit/llvm/config.py:520: note: using ld64.lld: /usr/local/google/home/thakis/src/llvm-project/out/gn/bin/ld64.lld
llvm-lit: /usr/local/google/home/thakis/src/llvm-project/llvm/utils/lit/lit/llvm/config.py:520: note: using wasm-ld: /usr/local/google/home/thakis/src/llvm-project/out/gn/bin/wasm-ld
-- Testing: 22199 tests, 64 workers --
Testing:  0.. 10.. 20.. 30.. 40.. 50.. 60.. 70.. 80.. 90..

Testing Time: 129.17s

Total Discovered Tests: 46810
  Skipped          :     4 (0.01%)
  Unsupported      :   144 (0.31%)
  Passed           : 46631 (99.62%)
  Expectedly Failed:    31 (0.07%)
INFO:2025-03-19T20:55:51Z:root:test check-clang-tools
ninja: Entering directory `out/gn'
[0/2] ACTION //clang-tools-extra/test:check-clang-tools(//llvm/utils/gn/build/toolchain:unix)
llvm-lit: /usr/local/google/home/thakis/src/llvm-project/llvm/utils/lit/lit/llvm/config.py:520: note: using clang: /usr/local/google/home/thakis/src/llvm-project/out/gn/bin/clang
-- Testing: 1186 tests, 64 workers --
Testing:  0.. 10.. 20.. 30.. 40.. 50.. 60.. 70.. 80.. 90..

Testing Time: 7.42s

Total Discovered Tests: 1428
  Unsupported      :    2 (0.14%)
  Passed           : 1425 (99.79%)
  Expectedly Failed:    1 (0.07%)
INFO:2025-03-19T20:56:01Z:root:test check-clangd
ninja: Entering directory `out/gn'
[0/2] ACTION //clang-tools-extra/clangd/test:check-clangd(//llvm/utils/gn/build/toolchain:unix)
llvm-lit: /usr/local/google/home/thakis/src/llvm-project/llvm/utils/lit/lit/llvm/config.py:520: note: using clang: /usr/local/google/home/thakis/src/llvm-project/out/gn/bin/clang
-- Testing: 168 tests, 64 workers --
Testing:  0.. 10.. 20.. 30.. 40.. 50.. 60.. 70.. 80.. 90..

Testing Time: 5.91s

Total Discovered Tests: 1372
  Unsupported:    6 (0.44%)
  Passed     : 1366 (99.56%)
INFO:2025-03-19T20:56:08Z:root:test check-hwasan
ninja: Entering directory `out/gn'
[0/2] ACTION //compiler-rt/test/hwasan:check-hwasan(//llvm/utils/gn/build/toolchain:unix)
llvm-lit: /usr/local/google/home/thakis/src/llvm-project/compiler-rt/test/lit.common.cfg.py:60: warning: Path reported by clang does not exist: "/usr/local/google/home/thakis/src/llvm-project/out/gn/lib/clang/21/lib/x86_64-unknown-linux-gnu". This path was found by running ['/usr/local/google/home/thakis/src/llvm-project/out/gn/bin/clang', '--target=x86_64-unknown-linux-gnu', '-print-runtime-dir'].
-- Testing: 109 tests, 64 workers --
Testing:  0.. 10.. 20.. 30.. 40.. 50.. 60.. 70.. 80.. 90.. 

1 warning(s) in tests

Testing Time: 8.25s

Total Discovered Tests: 109
  Unsupported      : 37 (33.94%)
  Passed           : 63 (57.80%)
  Expectedly Failed:  9 (8.26%)
INFO:2025-03-19T20:56:17Z:root:test check-lld
ninja: Entering directory `out/gn'
[0/2] ACTION //lld/test:check-lld(//llvm/utils/gn/build/toolchain:unix)
llvm-lit: /usr/local/google/home/thakis/src/llvm-project/llvm/utils/lit/lit/llvm/config.py:520: note: using ld.lld: /usr/local/google/home/thakis/src/llvm-project/out/gn/bin/ld.lld
llvm-lit: /usr/local/google/home/thakis/src/llvm-project/llvm/utils/lit/lit/llvm/config.py:520: note: using lld-link: /usr/local/google/home/thakis/src/llvm-project/out/gn/bin/lld-link
llvm-lit: /usr/local/google/home/thakis/src/llvm-project/llvm/utils/lit/lit/llvm/config.py:520: note: using ld64.lld: /usr/local/google/home/thakis/src/llvm-project/out/gn/bin/ld64.lld
llvm-lit: /usr/local/google/home/thakis/src/llvm-project/llvm/utils/lit/lit/llvm/config.py:520: note: using wasm-ld: /usr/local/google/home/thakis/src/llvm-project/out/gn/bin/wasm-ld
-- Testing: 3069 tests, 64 workers --
Testing:  0.. 10.. 20.. 30.. 40.. 50.. 60.. 70.. 80.. 90.. 

Testing Time: 13.95s

Total Discovered Tests: 3069
  Unsupported      :   21 (0.68%)
  Passed           : 3047 (99.28%)
  Expectedly Failed:    1 (0.03%)
INFO:2025-03-19T20:56:33Z:root:test check-llvm
ninja: Entering directory `out/gn'
[0/2] ACTION //llvm/test:check-llvm(//llvm/utils/gn/build/toolchain:unix)
llvm-lit: /usr/local/google/home/thakis/src/llvm-project/llvm/utils/lit/lit/llvm/config.py:520: note: using ld.lld: /usr/local/google/home/thakis/src/llvm-project/out/gn/bin/ld.lld
llvm-lit: /usr/local/google/home/thakis/src/llvm-project/llvm/utils/lit/lit/llvm/config.py:520: note: using lld-link: /usr/local/google/home/thakis/src/llvm-project/out/gn/bin/lld-link
llvm-lit: /usr/local/google/home/thakis/src/llvm-project/llvm/utils/lit/lit/llvm/config.py:520: note: using ld64.lld: /usr/local/google/home/thakis/src/llvm-project/out/gn/bin/ld64.lld
llvm-lit: /usr/local/google/home/thakis/src/llvm-project/llvm/utils/lit/lit/llvm/config.py:520: note: using wasm-ld: /usr/local/google/home/thakis/src/llvm-project/out/gn/bin/wasm-ld
-- Testing: 58674 tests, 64 workers --
Testing: 
FAIL: LLVM :: tools/llvm-ml/repeat_directives.asm (1 of 58674)
******************** TEST 'LLVM :: tools/llvm-ml/repeat_directives.asm' FAILED ********************
Exit Code: 2

Command Output (stderr):
--
RUN: at line 1: llvm-ml64 -filetype=s /usr/local/google/home/thakis/src/llvm-project/llvm/test/tools/llvm-ml/repeat_directives.asm /Fo - | /usr/local/google/home/thakis/src/llvm-project/out/gn/bin/FileCheck /usr/local/google/home/thakis/src/llvm-project/llvm/test/tools/llvm-ml/repeat_directives.asm
+ llvm-ml64 -filetype=s /usr/local/google/home/thakis/src/llvm-project/llvm/test/tools/llvm-ml/repeat_directives.asm /Fo -
/usr/local/google/home/thakis/src/llvm-project/out/gn/obj/llvm/test/tools/llvm-ml/Output/repeat_directives.asm.script: line 1: llvm-ml64: command not found
+ /usr/local/google/home/thakis/src/llvm-project/out/gn/bin/FileCheck /usr/local/google/home/thakis/src/llvm-project/llvm/test/tools/llvm-ml/repeat_directives.asm
FileCheck error: '<stdin>' is empty.
FileCheck command line:  /usr/local/google/home/thakis/src/llvm-project/out/gn/bin/FileCheck /usr/local/google/home/thakis/src/llvm-project/llvm/test/tools/llvm-ml/repeat_directives.asm

--

********************
Testing: 
FAIL: LLVM :: tools/llvm-ml/dot_operator.asm (2 of 58674)
******************** TEST 'LLVM :: tools/llvm-ml/dot_operator.asm' FAILED ********************
Exit Code: 2

Command Output (stderr):
--
RUN: at line 1: llvm-ml64 -filetype=s /usr/local/google/home/thakis/src/llvm-project/llvm/test/tools/llvm-ml/dot_operator.asm /Fo - | /usr/local/google/home/thakis/src/llvm-project/out/gn/bin/FileCheck /usr/local/google/home/thakis/src/llvm-project/llvm/test/tools/llvm-ml/dot_operator.asm
+ /usr/local/google/home/thakis/src/llvm-project/out/gn/bin/FileCheck /usr/local/google/home/thakis/src/llvm-project/llvm/test/tools/llvm-ml/dot_operator.asm
+ llvm-ml64 -filetype=s /usr/local/google/home/thakis/src/llvm-project/llvm/test/tools/llvm-ml/dot_operator.asm /Fo -
/usr/local/google/home/thakis/src/llvm-project/out/gn/obj/llvm/test/tools/llvm-ml/Output/dot_operator.asm.script: line 1: llvm-ml64: command not found
FileCheck error: '<stdin>' is empty.
FileCheck command line:  /usr/local/google/home/thakis/src/llvm-project/out/gn/bin/FileCheck /usr/local/google/home/thakis/src/llvm-project/llvm/test/tools/llvm-ml/dot_operator.asm

--

********************
Testing: 
FAIL: LLVM :: tools/llvm-ml/macro.asm (3 of 58674)
******************** TEST 'LLVM :: tools/llvm-ml/macro.asm' FAILED ********************
Exit Code: 2

Command Output (stderr):
--
RUN: at line 1: llvm-ml64 -filetype=s /usr/local/google/home/thakis/src/llvm-project/llvm/test/tools/llvm-ml/macro.asm /Fo - | /usr/local/google/home/thakis/src/llvm-project/out/gn/bin/FileCheck /usr/local/google/home/thakis/src/llvm-project/llvm/test/tools/llvm-ml/macro.asm
+ llvm-ml64 -filetype=s /usr/local/google/home/thakis/src/llvm-project/llvm/test/tools/llvm-ml/macro.asm /Fo -
/usr/local/google/home/thakis/src/llvm-project/out/gn/obj/llvm/test/tools/llvm-ml/Output/macro.asm.script: line 1: llvm-ml64: command not found
+ /usr/local/google/home/thakis/src/llvm-project/out/gn/bin/FileCheck /usr/local/google/home/thakis/src/llvm-project/llvm/test/tools/llvm-ml/macro.asm
FileCheck error: '<stdin>' is empty.
FileCheck command line:  /usr/local/google/home/thakis/src/llvm-project/out/gn/bin/FileCheck /usr/local/google/home/thakis/src/llvm-project/llvm/test/tools/llvm-ml/macro.asm

--

********************
Testing: 
FAIL: LLVM :: tools/llvm-ml/strings_errors.asm (4 of 58674)
******************** TEST 'LLVM :: tools/llvm-ml/strings_errors.asm' FAILED ********************
Exit Code: 1

Command Output (stderr):
--
RUN: at line 1: not llvm-ml64 -filetype=s /usr/local/google/home/thakis/src/llvm-project/llvm/test/tools/llvm-ml/strings_errors.asm /Fo /dev/null 2>&1 | /usr/local/google/home/thakis/src/llvm-project/out/gn/bin/FileCheck /usr/local/google/home/thakis/src/llvm-project/llvm/test/tools/llvm-ml/strings_errors.asm --implicit-check-not=error:
+ not llvm-ml64 -filetype=s /usr/local/google/home/thakis/src/llvm-project/llvm/test/tools/llvm-ml/strings_errors.asm /Fo /dev/null
+ /usr/local/google/home/thakis/src/llvm-project/out/gn/bin/FileCheck /usr/local/google/home/thakis/src/llvm-project/llvm/test/tools/llvm-ml/strings_errors.asm --implicit-check-not=error:
/usr/local/google/home/thakis/src/llvm-project/llvm/test/tools/llvm-ml/strings_errors.asm:9:10: error: CHECK: expected string not found in input
; CHECK: error: literal value out of range
         ^
<stdin>:1:1: note: scanning from here
error: unable to find `llvm-ml64' in PATH: No such file or directory
^
<stdin>:1:55: note: possible intended match here
error: unable to find `llvm-ml64' in PATH: No such file or directory
                                                      ^

Input file: <stdin>
Check file: /usr/local/google/home/thakis/src/llvm-project/llvm/test/tools/llvm-ml/strings_errors.asm

-dump-input=help explains the following input dump.

Input was:
<<<<<<
           1: error: unable to find `llvm-ml64' in PATH: No such file or directory 
check:9'0     X~~~~~~~~~~~~~~~~~~~~~~~~~~~~~~~~~~~~~~~~~~~~~~~~~~~~~~~~~~~~~~~~~~~~ error: no match found
check:9'1                                                           ?               possible intended match
>>>>>>

--

********************
Testing: 
FAIL: LLVM :: tools/llvm-ml/proc_frame.asm (5 of 58674)
******************** TEST 'LLVM :: tools/llvm-ml/proc_frame.asm' FAILED ********************
Exit Code: 2

Command Output (stderr):
--
RUN: at line 1: llvm-ml64 -filetype=s /usr/local/google/home/thakis/src/llvm-project/llvm/test/tools/llvm-ml/proc_frame.asm /Fo - | /usr/local/google/home/thakis/src/llvm-project/out/gn/bin/FileCheck /usr/local/google/home/thakis/src/llvm-project/llvm/test/tools/llvm-ml/proc_frame.asm
+ llvm-ml64 -filetype=s /usr/local/google/home/thakis/src/llvm-project/llvm/test/tools/llvm-ml/proc_frame.asm /Fo -
/usr/local/google/home/thakis/src/llvm-project/out/gn/obj/llvm/test/tools/llvm-ml/Output/proc_frame.asm.script: line 1: llvm-ml64: command not found
+ /usr/local/google/home/thakis/src/llvm-project/out/gn/bin/FileCheck /usr/local/google/home/thakis/src/llvm-project/llvm/test/tools/llvm-ml/proc_frame.asm
FileCheck error: '<stdin>' is empty.
FileCheck command line:  /usr/local/google/home/thakis/src/llvm-project/out/gn/bin/FileCheck /usr/local/google/home/thakis/src/llvm-project/llvm/test/tools/llvm-ml/proc_frame.asm

--

********************
Testing: 
FAIL: LLVM :: tools/llvm-ml/indirect_branch.asm (6 of 58674)
******************** TEST 'LLVM :: tools/llvm-ml/indirect_branch.asm' FAILED ********************
Exit Code: 2

Command Output (stderr):
--
RUN: at line 1: llvm-ml64 -filetype=s /usr/local/google/home/thakis/src/llvm-project/llvm/test/tools/llvm-ml/indirect_branch.asm /Fo - | /usr/local/google/home/thakis/src/llvm-project/out/gn/bin/FileCheck /usr/local/google/home/thakis/src/llvm-project/llvm/test/tools/llvm-ml/indirect_branch.asm --check-prefixes=CHECK-64,CHECK
+ llvm-ml64 -filetype=s /usr/local/google/home/thakis/src/llvm-project/llvm/test/tools/llvm-ml/indirect_branch.asm /Fo -
/usr/local/google/home/thakis/src/llvm-project/out/gn/obj/llvm/test/tools/llvm-ml/Output/indirect_branch.asm.script: line 1: llvm-ml64: command not found
+ /usr/local/google/home/thakis/src/llvm-project/out/gn/bin/FileCheck /usr/local/google/home/thakis/src/llvm-project/llvm/test/tools/llvm-ml/indirect_branch.asm --check-prefixes=CHECK-64,CHECK
FileCheck error: '<stdin>' is empty.
FileCheck command line:  /usr/local/google/home/thakis/src/llvm-project/out/gn/bin/FileCheck /usr/local/google/home/thakis/src/llvm-project/llvm/test/tools/llvm-ml/indirect_branch.asm --check-prefixes=CHECK-64,CHECK

--

********************
Testing: 
FAIL: LLVM :: tools/llvm-ml/architecture.asm (7 of 58674)
******************** TEST 'LLVM :: tools/llvm-ml/architecture.asm' FAILED ********************
Exit Code: 2

Command Output (stderr):
--
RUN: at line 1: llvm-ml64 -filetype=s /usr/local/google/home/thakis/src/llvm-project/llvm/test/tools/llvm-ml/architecture.asm /Fo - | /usr/local/google/home/thakis/src/llvm-project/out/gn/bin/FileCheck /usr/local/google/home/thakis/src/llvm-project/llvm/test/tools/llvm-ml/architecture.asm --implicit-check-not=error:
+ llvm-ml64 -filetype=s /usr/local/google/home/thakis/src/llvm-project/llvm/test/tools/llvm-ml/architecture.asm /Fo -
/usr/local/google/home/thakis/src/llvm-project/out/gn/obj/llvm/test/tools/llvm-ml/Output/architecture.asm.script: line 1: llvm-ml64: command not found
+ /usr/local/google/home/thakis/src/llvm-project/out/gn/bin/FileCheck /usr/local/google/home/thakis/src/llvm-project/llvm/test/tools/llvm-ml/architecture.asm --implicit-check-not=error:
FileCheck error: '<stdin>' is empty.
FileCheck command line:  /usr/local/google/home/thakis/src/llvm-project/out/gn/bin/FileCheck /usr/local/google/home/thakis/src/llvm-project/llvm/test/tools/llvm-ml/architecture.asm --implicit-check-not=error:

--

********************
Testing: 
FAIL: LLVM :: tools/llvm-ml/proc.asm (8 of 58674)
******************** TEST 'LLVM :: tools/llvm-ml/proc.asm' FAILED ********************
Exit Code: 2

Command Output (stderr):
--
RUN: at line 1: llvm-ml -filetype=s /usr/local/google/home/thakis/src/llvm-project/llvm/test/tools/llvm-ml/proc.asm /Fo - | /usr/local/google/home/thakis/src/llvm-project/out/gn/bin/FileCheck /usr/local/google/home/thakis/src/llvm-project/llvm/test/tools/llvm-ml/proc.asm
+ llvm-ml -filetype=s /usr/local/google/home/thakis/src/llvm-project/llvm/test/tools/llvm-ml/proc.asm /Fo -
+ /usr/local/google/home/thakis/src/llvm-project/out/gn/bin/FileCheck /usr/local/google/home/thakis/src/llvm-project/llvm/test/tools/llvm-ml/proc.asm
RUN: at line 2: llvm-ml64 -filetype=s /usr/local/google/home/thakis/src/llvm-project/llvm/test/tools/llvm-ml/proc.asm /Fo - | /usr/local/google/home/thakis/src/llvm-project/out/gn/bin/FileCheck /usr/local/google/home/thakis/src/llvm-project/llvm/test/tools/llvm-ml/proc.asm
+ llvm-ml64 -filetype=s /usr/local/google/home/thakis/src/llvm-project/llvm/test/tools/llvm-ml/proc.asm /Fo -
/usr/local/google/home/thakis/src/llvm-project/out/gn/obj/llvm/test/tools/llvm-ml/Output/proc.asm.script: line 2: llvm-ml64: command not found
+ /usr/local/google/home/thakis/src/llvm-project/out/gn/bin/FileCheck /usr/local/google/home/thakis/src/llvm-project/llvm/test/tools/llvm-ml/proc.asm
FileCheck error: '<stdin>' is empty.
FileCheck command line:  /usr/local/google/home/thakis/src/llvm-project/out/gn/bin/FileCheck /usr/local/google/home/thakis/src/llvm-project/llvm/test/tools/llvm-ml/proc.asm

--

********************
Testing: 
FAIL: LLVM :: tools/llvm-ml/nested_proc.asm (9 of 58674)
******************** TEST 'LLVM :: tools/llvm-ml/nested_proc.asm' FAILED ********************
Exit Code: 2

Command Output (stderr):
--
RUN: at line 1: llvm-ml -filetype=s /usr/local/google/home/thakis/src/llvm-project/llvm/test/tools/llvm-ml/nested_proc.asm /Fo - | /usr/local/google/home/thakis/src/llvm-project/out/gn/bin/FileCheck /usr/local/google/home/thakis/src/llvm-project/llvm/test/tools/llvm-ml/nested_proc.asm
+ llvm-ml -filetype=s /usr/local/google/home/thakis/src/llvm-project/llvm/test/tools/llvm-ml/nested_proc.asm /Fo -
+ /usr/local/google/home/thakis/src/llvm-project/out/gn/bin/FileCheck /usr/local/google/home/thakis/src/llvm-project/llvm/test/tools/llvm-ml/nested_proc.asm
RUN: at line 2: llvm-ml64 -filetype=s /usr/local/google/home/thakis/src/llvm-project/llvm/test/tools/llvm-ml/nested_proc.asm /Fo - | /usr/local/google/home/thakis/src/llvm-project/out/gn/bin/FileCheck /usr/local/google/home/thakis/src/llvm-project/llvm/test/tools/llvm-ml/nested_proc.asm
+ llvm-ml64 -filetype=s /usr/local/google/home/thakis/src/llvm-project/llvm/test/tools/llvm-ml/nested_proc.asm /Fo -
/usr/local/google/home/thakis/src/llvm-project/out/gn/obj/llvm/test/tools/llvm-ml/Output/nested_proc.asm.script: line 2: llvm-ml64: command not found
+ /usr/local/google/home/thakis/src/llvm-project/out/gn/bin/FileCheck /usr/local/google/home/thakis/src/llvm-project/llvm/test/tools/llvm-ml/nested_proc.asm
FileCheck error: '<stdin>' is empty.
FileCheck command line:  /usr/local/google/home/thakis/src/llvm-project/out/gn/bin/FileCheck /usr/local/google/home/thakis/src/llvm-project/llvm/test/tools/llvm-ml/nested_proc.asm

--

********************
Testing: 
FAIL: LLVM :: tools/llvm-ml/extern.asm (10 of 58674)
******************** TEST 'LLVM :: tools/llvm-ml/extern.asm' FAILED ********************
Exit Code: 2

Command Output (stderr):
--
RUN: at line 1: llvm-ml -filetype=s /usr/local/google/home/thakis/src/llvm-project/llvm/test/tools/llvm-ml/extern.asm /Fo - | /usr/local/google/home/thakis/src/llvm-project/out/gn/bin/FileCheck /usr/local/google/home/thakis/src/llvm-project/llvm/test/tools/llvm-ml/extern.asm --check-prefixes=CHECK,CHECK-32
+ llvm-ml -filetype=s /usr/local/google/home/thakis/src/llvm-project/llvm/test/tools/llvm-ml/extern.asm /Fo -
+ /usr/local/google/home/thakis/src/llvm-project/out/gn/bin/FileCheck /usr/local/google/home/thakis/src/llvm-project/llvm/test/tools/llvm-ml/extern.asm --check-prefixes=CHECK,CHECK-32
RUN: at line 2: llvm-ml64 -filetype=s /usr/local/google/home/thakis/src/llvm-project/llvm/test/tools/llvm-ml/extern.asm /Fo - | /usr/local/google/home/thakis/src/llvm-project/out/gn/bin/FileCheck /usr/local/google/home/thakis/src/llvm-project/llvm/test/tools/llvm-ml/extern.asm --check-prefixes=CHECK,CHECK-64
+ llvm-ml64 -filetype=s /usr/local/google/home/thakis/src/llvm-project/llvm/test/tools/llvm-ml/extern.asm /Fo -
/usr/local/google/home/thakis/src/llvm-project/out/gn/obj/llvm/test/tools/llvm-ml/Output/extern.asm.script: line 2: llvm-ml64: command not found
+ /usr/local/google/home/thakis/src/llvm-project/out/gn/bin/FileCheck /usr/local/google/home/thakis/src/llvm-project/llvm/test/tools/llvm-ml/extern.asm --check-prefixes=CHECK,CHECK-64
FileCheck error: '<stdin>' is empty.
FileCheck command line:  /usr/local/google/home/thakis/src/llvm-project/out/gn/bin/FileCheck /usr/local/google/home/thakis/src/llvm-project/llvm/test/tools/llvm-ml/extern.asm --check-prefixes=CHECK,CHECK-64

--

********************
Testing: 
FAIL: LLVM :: tools/llvm-ml/rip_relative_addressing.asm (11 of 58674)
******************** TEST 'LLVM :: tools/llvm-ml/rip_relative_addressing.asm' FAILED ********************
Exit Code: 2

Command Output (stderr):
--
RUN: at line 1: llvm-ml -filetype=s /usr/local/google/home/thakis/src/llvm-project/llvm/test/tools/llvm-ml/rip_relative_addressing.asm /Fo - | /usr/local/google/home/thakis/src/llvm-project/out/gn/bin/FileCheck /usr/local/google/home/thakis/src/llvm-project/llvm/test/tools/llvm-ml/rip_relative_addressing.asm --check-prefixes=CHECK,CHECK-32
+ llvm-ml -filetype=s /usr/local/google/home/thakis/src/llvm-project/llvm/test/tools/llvm-ml/rip_relative_addressing.asm /Fo -
+ /usr/local/google/home/thakis/src/llvm-project/out/gn/bin/FileCheck /usr/local/google/home/thakis/src/llvm-project/llvm/test/tools/llvm-ml/rip_relative_addressing.asm --check-prefixes=CHECK,CHECK-32
RUN: at line 2: llvm-ml64 -filetype=s /usr/local/google/home/thakis/src/llvm-project/llvm/test/tools/llvm-ml/rip_relative_addressing.asm /Fo - | /usr/local/google/home/thakis/src/llvm-project/out/gn/bin/FileCheck /usr/local/google/home/thakis/src/llvm-project/llvm/test/tools/llvm-ml/rip_relative_addressing.asm --check-prefixes=CHECK,CHECK-64
+ llvm-ml64 -filetype=s /usr/local/google/home/thakis/src/llvm-project/llvm/test/tools/llvm-ml/rip_relative_addressing.asm /Fo -
/usr/local/google/home/thakis/src/llvm-project/out/gn/obj/llvm/test/tools/llvm-ml/Output/rip_relative_addressing.asm.script: line 2: llvm-ml64: command not found
+ /usr/local/google/home/thakis/src/llvm-project/out/gn/bin/FileCheck /usr/local/google/home/thakis/src/llvm-project/llvm/test/tools/llvm-ml/rip_relative_addressing.asm --check-prefixes=CHECK,CHECK-64
FileCheck error: '<stdin>' is empty.
FileCheck command line:  /usr/local/google/home/thakis/src/llvm-project/out/gn/bin/FileCheck /usr/local/google/home/thakis/src/llvm-project/llvm/test/tools/llvm-ml/rip_relative_addressing.asm --check-prefixes=CHECK,CHECK-64

--

********************
Testing: 
FAIL: LLVM :: tools/llvm-ml/feat00_override.asm (12 of 58674)
******************** TEST 'LLVM :: tools/llvm-ml/feat00_override.asm' FAILED ********************
Exit Code: 2

Command Output (stderr):
--
RUN: at line 1: llvm-ml /usr/local/google/home/thakis/src/llvm-project/llvm/test/tools/llvm-ml/feat00_override.asm /Fo - | /usr/local/google/home/thakis/src/llvm-project/out/gn/bin/llvm-readobj --syms - | /usr/local/google/home/thakis/src/llvm-project/out/gn/bin/FileCheck /usr/local/google/home/thakis/src/llvm-project/llvm/test/tools/llvm-ml/feat00_override.asm
+ llvm-ml /usr/local/google/home/thakis/src/llvm-project/llvm/test/tools/llvm-ml/feat00_override.asm /Fo -
+ /usr/local/google/home/thakis/src/llvm-project/out/gn/bin/llvm-readobj --syms -
+ /usr/local/google/home/thakis/src/llvm-project/out/gn/bin/FileCheck /usr/local/google/home/thakis/src/llvm-project/llvm/test/tools/llvm-ml/feat00_override.asm
RUN: at line 2: llvm-ml64 /usr/local/google/home/thakis/src/llvm-project/llvm/test/tools/llvm-ml/feat00_override.asm /Fo - | /usr/local/google/home/thakis/src/llvm-project/out/gn/bin/llvm-readobj --syms - | /usr/local/google/home/thakis/src/llvm-project/out/gn/bin/FileCheck /usr/local/google/home/thakis/src/llvm-project/llvm/test/tools/llvm-ml/feat00_override.asm
+ llvm-ml64 /usr/local/google/home/thakis/src/llvm-project/llvm/test/tools/llvm-ml/feat00_override.asm /Fo -
/usr/local/google/home/thakis/src/llvm-project/out/gn/obj/llvm/test/tools/llvm-ml/Output/feat00_override.asm.script: line 2: llvm-ml64: command not found
+ /usr/local/google/home/thakis/src/llvm-project/out/gn/bin/llvm-readobj --syms -
+ /usr/local/google/home/thakis/src/llvm-project/out/gn/bin/FileCheck /usr/local/google/home/thakis/src/llvm-project/llvm/test/tools/llvm-ml/feat00_override.asm
/usr/local/google/home/thakis/src/llvm-project/out/gn/bin/llvm-readobj: error: '<stdin>': The file was not recognized as a valid object file
FileCheck error: '<stdin>' is empty.
FileCheck command line:  /usr/local/google/home/thakis/src/llvm-project/out/gn/bin/FileCheck /usr/local/google/home/thakis/src/llvm-project/llvm/test/tools/llvm-ml/feat00_override.asm

--

********************
Testing: 
FAIL: LLVM :: tools/llvm-ml/feat00.asm (13 of 58674)
******************** TEST 'LLVM :: tools/llvm-ml/feat00.asm' FAILED ********************
Exit Code: 2

Command Output (stderr):
--
RUN: at line 1: llvm-ml /usr/local/google/home/thakis/src/llvm-project/llvm/test/tools/llvm-ml/feat00.asm /Fo - | /usr/local/google/home/thakis/src/llvm-project/out/gn/bin/llvm-readobj --syms - | /usr/local/google/home/thakis/src/llvm-project/out/gn/bin/FileCheck /usr/local/google/home/thakis/src/llvm-project/llvm/test/tools/llvm-ml/feat00.asm --check-prefix=CHECK-OBJ --check-prefix=CHECK-OBJ-NOSAFESEH
+ llvm-ml /usr/local/google/home/thakis/src/llvm-project/llvm/test/tools/llvm-ml/feat00.asm /Fo -
+ /usr/local/google/home/thakis/src/llvm-project/out/gn/bin/llvm-readobj --syms -
+ /usr/local/google/home/thakis/src/llvm-project/out/gn/bin/FileCheck /usr/local/google/home/thakis/src/llvm-project/llvm/test/tools/llvm-ml/feat00.asm --check-prefix=CHECK-OBJ --check-prefix=CHECK-OBJ-NOSAFESEH
RUN: at line 2: llvm-ml64 /usr/local/google/home/thakis/src/llvm-project/llvm/test/tools/llvm-ml/feat00.asm /Fo - | /usr/local/google/home/thakis/src/llvm-project/out/gn/bin/llvm-readobj --syms - | /usr/local/google/home/thakis/src/llvm-project/out/gn/bin/FileCheck /usr/local/google/home/thakis/src/llvm-project/llvm/test/tools/llvm-ml/feat00.asm --check-prefix=CHECK-OBJ --check-prefix=CHECK-OBJ-NOSAFESEH
+ llvm-ml64 /usr/local/google/home/thakis/src/llvm-project/llvm/test/tools/llvm-ml/feat00.asm /Fo -
/usr/local/google/home/thakis/src/llvm-project/out/gn/obj/llvm/test/tools/llvm-ml/Output/feat00.asm.script: line 2: llvm-ml64: command not found
+ /usr/local/google/home/thakis/src/llvm-project/out/gn/bin/llvm-readobj --syms -
+ /usr/local/google/home/thakis/src/llvm-project/out/gn/bin/FileCheck /usr/local/google/home/thakis/src/llvm-project/llvm/test/tools/llvm-ml/feat00.asm --check-prefix=CHECK-OBJ --check-prefix=CHECK-OBJ-NOSAFESEH
/usr/local/google/home/thakis/src/llvm-project/out/gn/bin/llvm-readobj: error: '<stdin>': The file was not recognized as a valid object file
FileCheck error: '<stdin>' is empty.
FileCheck command line:  /usr/local/google/home/thakis/src/llvm-project/out/gn/bin/FileCheck /usr/local/google/home/thakis/src/llvm-project/llvm/test/tools/llvm-ml/feat00.asm --check-prefix=CHECK-OBJ --check-prefix=CHECK-OBJ-NOSAFESEH

--

********************
Testing: 
FAIL: LLVM :: tools/llvm-ml/architecture_errors.asm (14 of 58674)
******************** TEST 'LLVM :: tools/llvm-ml/architecture_errors.asm' FAILED ********************
Exit Code: 1

Command Output (stderr):
--
RUN: at line 1: not llvm-ml -filetype=s /usr/local/google/home/thakis/src/llvm-project/llvm/test/tools/llvm-ml/architecture_errors.asm /Fo - 2>&1 | /usr/local/google/home/thakis/src/llvm-project/out/gn/bin/FileCheck /usr/local/google/home/thakis/src/llvm-project/llvm/test/tools/llvm-ml/architecture_errors.asm
+ not llvm-ml -filetype=s /usr/local/google/home/thakis/src/llvm-project/llvm/test/tools/llvm-ml/architecture_errors.asm /Fo -
+ /usr/local/google/home/thakis/src/llvm-project/out/gn/bin/FileCheck /usr/local/google/home/thakis/src/llvm-project/llvm/test/tools/llvm-ml/architecture_errors.asm
RUN: at line 2: not llvm-ml -m32 -filetype=s /usr/local/google/home/thakis/src/llvm-project/llvm/test/tools/llvm-ml/architecture_errors.asm /Fo - 2>&1 | /usr/local/google/home/thakis/src/llvm-project/out/gn/bin/FileCheck /usr/local/google/home/thakis/src/llvm-project/llvm/test/tools/llvm-ml/architecture_errors.asm
+ not llvm-ml -m32 -filetype=s /usr/local/google/home/thakis/src/llvm-project/llvm/test/tools/llvm-ml/architecture_errors.asm /Fo -
+ /usr/local/google/home/thakis/src/llvm-project/out/gn/bin/FileCheck /usr/local/google/home/thakis/src/llvm-project/llvm/test/tools/llvm-ml/architecture_errors.asm
RUN: at line 3: not llvm-ml64 -m32 -filetype=s /usr/local/google/home/thakis/src/llvm-project/llvm/test/tools/llvm-ml/architecture_errors.asm /Fo - 2>&1 | /usr/local/google/home/thakis/src/llvm-project/out/gn/bin/FileCheck /usr/local/google/home/thakis/src/llvm-project/llvm/test/tools/llvm-ml/architecture_errors.asm
+ not llvm-ml64 -m32 -filetype=s /usr/local/google/home/thakis/src/llvm-project/llvm/test/tools/llvm-ml/architecture_errors.asm /Fo -
+ /usr/local/google/home/thakis/src/llvm-project/out/gn/bin/FileCheck /usr/local/google/home/thakis/src/llvm-project/llvm/test/tools/llvm-ml/architecture_errors.asm
/usr/local/google/home/thakis/src/llvm-project/llvm/test/tools/llvm-ml/architecture_errors.asm:7:10: error: CHECK: expected string not found in input
; CHECK: :[[# @LINE + 1]]:5: error: register %rax is only available in 64-bit mode
         ^
<stdin>:1:1: note: scanning from here
error: unable to find `llvm-ml64' in PATH: No such file or directory
^
<stdin>:1:1: note: with " @LINE + 1" equal to "8"
error: unable to find `llvm-ml64' in PATH: No such file or directory
^
<stdin>:1:30: note: possible intended match here
error: unable to find `llvm-ml64' in PATH: No such file or directory
                             ^

Input file: <stdin>
Check file: /usr/local/google/home/thakis/src/llvm-project/llvm/test/tools/llvm-ml/architecture_errors.asm

-dump-input=help explains the following input dump.

Input was:
<<<<<<
           1: error: unable to find `llvm-ml64' in PATH: No such file or directory 
check:7'0     X~~~~~~~~~~~~~~~~~~~~~~~~~~~~~~~~~~~~~~~~~~~~~~~~~~~~~~~~~~~~~~~~~~~~ error: no match found
check:7'1                                                                           with " @LINE + 1" equal to "8"
check:7'2                                  ?                                        possible intended match
>>>>>>

--

********************
Testing: 
FAIL: LLVM :: tools/llvm-ml/struct.asm (15 of 58674)
******************** TEST 'LLVM :: tools/llvm-ml/struct.asm' FAILED ********************
Exit Code: 2

Command Output (stderr):
--
RUN: at line 1: llvm-ml64 -filetype=s /usr/local/google/home/thakis/src/llvm-project/llvm/test/tools/llvm-ml/struct.asm /Fo - | /usr/local/google/home/thakis/src/llvm-project/out/gn/bin/FileCheck /usr/local/google/home/thakis/src/llvm-project/llvm/test/tools/llvm-ml/struct.asm
+ llvm-ml64 -filetype=s /usr/local/google/home/thakis/src/llvm-project/llvm/test/tools/llvm-ml/struct.asm /Fo -
/usr/local/google/home/thakis/src/llvm-project/out/gn/obj/llvm/test/tools/llvm-ml/Output/struct.asm.script: line 1: llvm-ml64: command not found
+ /usr/local/google/home/thakis/src/llvm-project/out/gn/bin/FileCheck /usr/local/google/home/thakis/src/llvm-project/llvm/test/tools/llvm-ml/struct.asm
FileCheck error: '<stdin>' is empty.
FileCheck command line:  /usr/local/google/home/thakis/src/llvm-project/out/gn/bin/FileCheck /usr/local/google/home/thakis/src/llvm-project/llvm/test/tools/llvm-ml/struct.asm

--

********************
Testing:  0.. 10.. 20.. 30.. 40.. 50.. 60.. 70.. 80.. 90..
********************
Failed Tests (15):
  LLVM :: tools/llvm-ml/architecture.asm
  LLVM :: tools/llvm-ml/architecture_errors.asm
  LLVM :: tools/llvm-ml/dot_operator.asm
  LLVM :: tools/llvm-ml/extern.asm
  LLVM :: tools/llvm-ml/feat00.asm
  LLVM :: tools/llvm-ml/feat00_override.asm
  LLVM :: tools/llvm-ml/indirect_branch.asm
  LLVM :: tools/llvm-ml/macro.asm
  LLVM :: tools/llvm-ml/nested_proc.asm
  LLVM :: tools/llvm-ml/proc.asm
  LLVM :: tools/llvm-ml/proc_frame.asm
  LLVM :: tools/llvm-ml/repeat_directives.asm
  LLVM :: tools/llvm-ml/rip_relative_addressing.asm
  LLVM :: tools/llvm-ml/strings_errors.asm
  LLVM :: tools/llvm-ml/struct.asm


Testing Time: 166.42s

Total Discovered Tests: 64607
  Skipped          :    16 (0.02%)
  Unsupported      :  2108 (3.26%)
  Passed           : 62292 (96.42%)
  Expectedly Failed:   176 (0.27%)
  Failed           :    15 (0.02%)
FAILED: gen/llvm/test/run-lit 
python3 bin/llvm-lit -sv ../../llvm/test
ninja: build stopped: subcommand failed.
Command '['ninja', '-C', 'out/gn', 'check-llvm']' returned non-zero exit status 1.