INFO:2025-03-19T21:32:13Z:root:pulling...
From github.com:llvm/llvm-project
 * branch                      main       -> FETCH_HEAD
   93afd8f9ac69..fecd937910f6  main       -> origin/main
Switched to branch 'main'
Your branch is behind 'origin/main' by 1 commit, and can be fast-forwarded.
  (use "git pull" to update your local branch)
HEAD is now at fecd937910f6 [Clang] Fix UB in #131515 (#132091)
INFO:2025-03-19T21:32:15Z:root:syncing...
Deleted branch merge (was 93afd8f9ac69).
Switched to a new branch 'merge'
branch 'merge' set up to track 'origin/main'.
INFO:2025-03-19T21:32:16Z:root:building
ninja: Entering directory `out/gn'
[1/1798] CXX obj/clang-tools-extra/clang-doc/clang-doc.Generators.o
[2/1798] CXX obj/clang-tools-extra/clang-tidy/clang-tidy.ClangTidyModule.o
[3/1798] CXX obj/clang-tools-extra/clang-apply-replacements/tool/clang-apply-replacements.ClangApplyReplacementsMain.o
[4/1798] CXX obj/clang-tools-extra/clang-tidy/android/android.CloexecEpollCreateCheck.o
[5/1798] CXX obj/clang-tools-extra/clang-tidy/android/android.CloexecInotifyInitCheck.o
[6/1798] CXX obj/clang-tools-extra/clang-tidy/objc/objc.AvoidNSErrorInitCheck.o
[7/1798] CXX obj/clang-tools-extra/clang-tidy/objc/objc.ForbiddenSubclassingCheck.o
[8/1798] CXX obj/clang-tools-extra/clang-tidy/android/android.CloexecCreatCheck.o
[9/1798] CXX obj/clang-tools-extra/clang-tidy/clang-tidy.ClangTidyCheck.o
[10/1798] CXX obj/clang-tools-extra/clang-tidy/abseil/abseil.DurationAdditionCheck.o
[11/1798] CXX obj/clang-tools-extra/clang-tidy/android/android.CloexecAcceptCheck.o
[12/1798] CXX obj/clang-tools-extra/clang-tidy/android/android.CloexecDupCheck.o
[13/1798] CXX obj/clang-tools-extra/clang-doc/clang-doc.MDGenerator.o
[14/1798] CXX obj/clang-tools-extra/clang-tidy/modernize/modernize.UseUncaughtExceptionsCheck.o
[15/1798] CXX obj/clang-tools-extra/clang-tidy/misc/misc.DefinitionsInHeadersCheck.o
[16/1798] CXX obj/clang-tools-extra/clang-tidy/abseil/abseil.TimeComparisonCheck.o
[17/1798] CXX obj/clang-tools-extra/clang-tidy/android/android.CloexecEpollCreate1Check.o
[18/1798] CXX obj/clang-tools-extra/clang-tidy/android/android.CloexecCheck.o
[19/1798] CXX obj/clang-tools-extra/clang-include-fixer/find-all-symbols/find-all-symbols.PragmaCommentHandler.o
[20/1798] CXX obj/clang-tools-extra/clang-tidy/misc/misc.HeaderIncludeCycleCheck.o
[21/1798] CXX obj/clang-tools-extra/clang-tidy/modernize/modernize.UseUsingCheck.o
[22/1798] CXX obj/clang-tools-extra/clangd/index/dex/dexp/dexp.Dexp.o
[23/1798] CXX obj/clang-tools-extra/clang-include-fixer/tool/clang-include-fixer.ClangIncludeFixer.o
[24/1798] CXX obj/clang-tools-extra/clang-apply-replacements/lib/Tooling/clang-apply-replacements.ApplyReplacements.o
[25/1798] CXX obj/clang-tools-extra/clang-doc/clang-doc.ClangDoc.o
[26/1798] CXX obj/clang-tools-extra/clang-doc/clang-doc.YAMLGenerator.o
[27/1798] CXX obj/clang-tools-extra/clang-tidy/abseil/abseil.UpgradeDurationConversionsCheck.o
[28/1798] CXX obj/clang-tools-extra/clang-tidy/abseil/abseil.TimeSubtractionCheck.o
[29/1798] CXX obj/clang-tools-extra/clang-tidy/abseil/abseil.RedundantStrcatCallsCheck.o
[30/1798] CXX obj/clang-tools-extra/clang-tidy/abseil/abseil.DurationDivisionCheck.o
[31/1798] CXX obj/clang/unittests/Frontend/FrontendTests.FrontendActionTest.o
[32/1798] CXX obj/clang-tools-extra/clang-tidy/objc/objc.AssertEquals.o
[33/1798] CXX obj/clang-tools-extra/clang-include-fixer/clang-include-fixer.IncludeFixer.o
[34/1798] CXX obj/clang-tools-extra/clang-tidy/altera/altera.KernelNameRestrictionCheck.o
[35/1798] CXX obj/clang-tools-extra/clang-tidy/bugprone/bugprone.AssertSideEffectCheck.o
[36/1798] CXX obj/clang-tools-extra/clang-doc/clang-doc.HTMLGenerator.o
[37/1798] CXX obj/clang-tools-extra/clang-tidy/misc/misc.MisleadingBidirectional.o
[38/1798] CXX obj/clang-tools-extra/clang-doc/clang-doc.BitcodeWriter.o
[39/1798] CXX obj/clang/lib/ASTMatchers/ASTMatchers.GtestMatchers.o
[40/1798] CXX obj/clang-tools-extra/clang-include-fixer/find-all-symbols/find-all-symbols.FindAllSymbolsAction.o
[41/1798] CXX obj/clang-tools-extra/clang-move/clang-move.HelperDeclRefGraph.o
[42/1798] CXX obj/clang-tools-extra/clang-tidy/mpi/mpi.BufferDerefCheck.o
[43/1798] CXX obj/clang-tools-extra/clang-tidy/mpi/mpi.MPITidyModule.o
[44/1798] CXX obj/clang-tools-extra/clang-query/tool/clang-query.ClangQuery.o
[45/1798] CXX obj/clang-tools-extra/clang-tidy/abseil/abseil.DurationFactoryFloatCheck.o
[46/1798] CXX obj/clang-tools-extra/unittests/clang-doc/ClangDocTests.HTMLGeneratorTest.o
[47/1798] CXX obj/clang-tools-extra/clang-tidy/abseil/abseil.StringFindStrContainsCheck.o
[48/1798] CXX obj/clang-tools-extra/clang-change-namespace/tool/clang-change-namespace.ClangChangeNamespace.o
[49/1798] CXX obj/clang-tools-extra/clang-move/tool/clang-move.ClangMove.o
[50/1798] CXX obj/clang-tools-extra/clang-doc/clang-doc.Serialize.o
[51/1798] CXX obj/clang/unittests/Frontend/FrontendTests.CompilerInvocationTest.o
[52/1798] CXX obj/clang-tools-extra/clang-include-fixer/find-all-symbols/tool/find-all-symbols.FindAllSymbolsMain.o
[53/1798] CXX obj/clang-tools-extra/clang-tidy/mpi/mpi.TypeMismatchCheck.o
[54/1798] CXX obj/clang-tools-extra/clang-doc/clang-doc.Representation.o
[55/1798] CXX obj/clang/unittests/CodeGen/ClangCodeGenTests.CodeGenExternalTest.o
[56/1798] CXX obj/clang-tools-extra/clang-doc/clang-doc.BitcodeReader.o
[57/1798] CXX obj/clang-tools-extra/clang-doc/tool/clang-doc.ClangDocMain.o
[58/1798] CXX obj/clang-tools-extra/clang-include-fixer/find-all-symbols/find-all-symbols.FindAllSymbols.o
[59/1798] CXX obj/clang-tools-extra/clang-query/clang-query.Query.o
[60/1798] CXX obj/clang-tools-extra/clang-change-namespace/clang-change-namespace.ChangeNamespace.o
[61/1798] CXX obj/clang-tools-extra/clang-tidy/clang-tidy.ClangTidy.o
[62/1798] CXX obj/clang-tools-extra/clang-reorder-fields/tool/clang-reorder-fields.ClangReorderFields.o
[63/1798] CXX obj/clang-tools-extra/clang-tidy/abseil/abseil.DurationSubtractionCheck.o
[64/1798] CXX obj/clang-tools-extra/clang-tidy/altera/altera.SingleWorkItemBarrierCheck.o
[65/1798] CXX obj/clang-tools-extra/clang-move/clang-move.Move.o
[66/1798] CXX obj/clang-tools-extra/clang-tidy/abseil/abseil.DurationComparisonCheck.o
[67/1798] CXX obj/clang-tools-extra/clang-tidy/misc/misc.ThrowByValueCatchByReferenceCheck.o
[68/1798] CXX obj/clang-tools-extra/clang-query/clang-query.QueryParser.o
[69/1798] CXX obj/clang/unittests/Frontend/FrontendTests.UtilsTest.o
[70/1798] CXX obj/clang-tools-extra/clang-tidy/abseil/abseil.DurationUnnecessaryConversionCheck.o
[71/1798] CXX obj/clang-tools-extra/clang-tidy/abseil/abseil.CleanupCtadCheck.o
[72/1798] CXX obj/clang-tools-extra/clang-tidy/misc/misc.UnusedAliasDeclsCheck.o
[73/1798] CXX obj/clang-tools-extra/clang-tidy/abseil/abseil.DurationFactoryScaleCheck.o
[74/1798] CXX obj/clang-tools-extra/clang-tidy/misc/misc.UniqueptrResetReleaseCheck.o
[75/1798] CXX obj/clang-tools-extra/clang-tidy/android/android.CloexecPipeCheck.o
[76/1798] CXX obj/clang-tools-extra/clang-tidy/altera/altera.UnrollLoopsCheck.o
[77/1798] CXX obj/clang-tools-extra/clang-tidy/abseil/abseil.DurationConversionCastCheck.o
[78/1798] CXX obj/clang-tools-extra/clang-tidy/clang-tidy.ExpandModularHeadersPPCallbacks.o
[79/1798] CXX obj/clang/unittests/CrossTU/CrossTUTests.CrossTranslationUnitTest.o
[80/1798] CXX obj/clang-tools-extra/clang-tidy/abseil/abseil.DurationRewriter.o
[81/1798] CXX obj/clang-tools-extra/clang-tidy/android/android.CloexecSocketCheck.o
[82/1798] CXX obj/clang-tools-extra/clang-tidy/android/android.ComparisonInTempFailureRetryCheck.o
[83/1798] CXX obj/clang-tools-extra/clang-tidy/android/android.CloexecOpenCheck.o
[84/1798] CXX obj/clang-tools-extra/clang-tidy/android/android.CloexecPipe2Check.o
[85/1798] CXX obj/clang/unittests/Frontend/FrontendTests.PCHPreambleTest.o
[86/1798] CXX obj/clang-tools-extra/clang-tidy/boost/boost.BoostTidyModule.o
[87/1798] CXX obj/clang-tools-extra/clang-tidy/misc/misc.UnusedUsingDeclsCheck.o
[88/1798] CXX obj/clang-tools-extra/clang-tidy/boost/boost.UseRangesCheck.o
[89/1798] CXX obj/clang-tools-extra/clang-tidy/misc/misc.UnconventionalAssignOperatorCheck.o
[90/1798] CXX obj/clang-tools-extra/clang-doc/clang-doc.Mapper.o
[91/1798] CXX obj/clang-tools-extra/clang-tidy/bugprone/bugprone.BitwisePointerCastCheck.o
[92/1798] CXX obj/clang-tools-extra/clang-tidy/altera/altera.AlteraTidyModule.o
[93/1798] CXX obj/clang-tools-extra/clang-tidy/bugprone/bugprone.ArgumentCommentCheck.o
[94/1798] CXX obj/clang-tools-extra/clang-tidy/abseil/abseil.AbseilTidyModule.o
[95/1798] CXX obj/clang-tools-extra/clang-tidy/altera/altera.IdDependentBackwardBranchCheck.o
[96/1798] CXX obj/clang-tools-extra/clang-tidy/altera/altera.StructPackAlignCheck.o
[97/1798] CXX obj/clang-tools-extra/clang-tidy/abseil/abseil.NoInternalDependenciesCheck.o
[98/1798] CXX obj/clang-tools-extra/clang-tidy/abseil/abseil.StrCatAppendCheck.o
[99/1798] CXX obj/clang-tools-extra/clang-tidy/abseil/abseil.NoNamespaceCheck.o
[100/1798] CXX obj/clang-tools-extra/clang-tidy/bugprone/bugprone.SuspiciousIncludeCheck.o
[101/1798] CXX obj/clang-tools-extra/clang-tidy/android/android.CloexecInotifyInit1Check.o
[102/1798] CXX obj/clang-tools-extra/clang-tidy/misc/misc.IncludeCleanerCheck.o
[103/1798] CXX obj/clang-tools-extra/clang-tidy/bugprone/bugprone.DynamicStaticInitializersCheck.o
[104/1798] CXX obj/clang-tools-extra/clang-tidy/misc/misc.StaticAssertCheck.o
[105/1798] CXX obj/clang-tools-extra/clang-tidy/android/android.CloexecFopenCheck.o
[106/1798] CXX obj/clang-tools-extra/clang-tidy/android/android.CloexecMemfdCreateCheck.o
[107/1798] CXX obj/clang-tools-extra/clang-tidy/android/android.CloexecAccept4Check.o
[108/1798] CXX obj/clang-tools-extra/clang-tidy/bugprone/bugprone.SuspiciousEnumUsageCheck.o
[109/1798] CXX obj/clang-tools-extra/clang-tidy/bugprone/bugprone.ComparePointerToMemberVirtualFunctionCheck.o
[110/1798] CXX obj/clang-tools-extra/clang-tidy/android/android.AndroidTidyModule.o
[111/1798] CXX obj/clang-tools-extra/clang-tidy/abseil/abseil.FasterStrsplitDelimiterCheck.o
[112/1798] CXX obj/clang-tools-extra/clang-tidy/bugprone/bugprone.CrtpConstructorAccessibilityCheck.o
[113/1798] CXX obj/clang-tools-extra/clang-tidy/bugprone/bugprone.CopyConstructorInitCheck.o
[114/1798] CXX obj/clang-tools-extra/unittests/clang-doc/ClangDocTests.SerializeTest.o
[115/1798] CXX obj/clang-tools-extra/clangd/refactor/tweaks/tweaks.AddUsing.o
[116/1798] CXX obj/clang-tools-extra/clang-reorder-fields/clang-reorder-fields.ReorderFieldsAction.o
[117/1798] CXX obj/clang-tools-extra/clang-tidy/bugprone/bugprone.EmptyCatchCheck.o
[118/1798] CXX obj/clang-tools-extra/clang-tidy/abseil/abseil.StringFindStartswithCheck.o
[119/1798] CXX obj/clang-tools-extra/clang-tidy/bugprone/bugprone.ExceptionEscapeCheck.o
[120/1798] CXX obj/clang-tools-extra/clang-tidy/bugprone/bugprone.DanglingHandleCheck.o
[121/1798] CXX obj/clang-tools-extra/clang-tidy/bugprone/bugprone.FoldInitTypeCheck.o
[122/1798] CXX obj/clang-tools-extra/clang-tidy/bugprone/bugprone.ForwardDeclarationNamespaceCheck.o
[123/1798] CXX obj/clang-tools-extra/clang-tidy/bugprone/bugprone.ForwardingReferenceOverloadCheck.o
[124/1798] CXX obj/clang-tools-extra/clang-tidy/boost/boost.UseToStringCheck.o
[125/1798] CXX obj/clang-tools-extra/clang-tidy/bugprone/bugprone.AssignmentInIfConditionCheck.o
[126/1798] CXX obj/clang-tools-extra/clang-tidy/bugprone/bugprone.BadSignalToKillThreadCheck.o
[127/1798] CXX obj/clang-tools-extra/clang-tidy/bugprone/bugprone.CastingThroughVoidCheck.o
[128/1798] CXX obj/clang-tools-extra/clang-tidy/bugprone/bugprone.ChainedComparisonCheck.o
[129/1798] CXX obj/clang-tools-extra/clang-tidy/bugprone/bugprone.CapturingThisInMemberVariableCheck.o
[130/1798] CXX obj/clang-tools-extra/clang-tidy/bugprone/bugprone.StringLiteralWithEmbeddedNulCheck.o
[131/1798] CXX obj/clang-tools-extra/clang-tidy/fuchsia/fuchsia.VirtualInheritanceCheck.o
[132/1798] CXX obj/clang-tools-extra/clang-tidy/fuchsia/fuchsia.TrailingReturnCheck.o
[133/1798] CXX obj/clang-tools-extra/clang-tidy/fuchsia/fuchsia.OverloadedOperatorCheck.o
[134/1798] CXX obj/clang-tools-extra/clang-tidy/cppcoreguidelines/cppcoreguidelines.AvoidReferenceCoroutineParametersCheck.o
[135/1798] CXX obj/clang-tools-extra/clang-tidy/cppcoreguidelines/cppcoreguidelines.VirtualClassDestructorCheck.o
[136/1798] CXX obj/clang-tools-extra/clang-tidy/google/google.AvoidNSObjectNewCheck.o
[137/1798] CXX obj/clang-tools-extra/clang-tidy/cppcoreguidelines/cppcoreguidelines.ProTypeConstCastCheck.o
[138/1798] CXX obj/clang-tools-extra/clang-tidy/bugprone/bugprone.StringIntegerAssignmentCheck.o
[139/1798] CXX obj/clang-tools-extra/clang-tidy/cppcoreguidelines/cppcoreguidelines.ProTypeReinterpretCastCheck.o
[140/1798] CXX obj/clang-tools-extra/clang-tidy/cppcoreguidelines/cppcoreguidelines.ProTypeStaticCastDowncastCheck.o
[141/1798] CXX obj/clang-tools-extra/clang-tidy/cppcoreguidelines/cppcoreguidelines.SlicingCheck.o
[142/1798] CXX obj/clang-tools-extra/clang-tidy/bugprone/bugprone.BoolPointerImplicitConversionCheck.o
[143/1798] CXX obj/clang-tools-extra/clang-tidy/cppcoreguidelines/cppcoreguidelines.SpecialMemberFunctionsCheck.o
[144/1798] CXX obj/clang-tools-extra/clang-tidy/cppcoreguidelines/cppcoreguidelines.ProTypeCstyleCastCheck.o
[145/1798] CXX obj/clang-tools-extra/clang-tidy/cppcoreguidelines/cppcoreguidelines.AvoidNonConstGlobalVariablesCheck.o
[146/1798] CXX obj/clang-tools-extra/clang-tidy/cppcoreguidelines/cppcoreguidelines.ProBoundsPointerArithmeticCheck.o
[147/1798] CXX obj/clang-tools-extra/clang-tidy/cppcoreguidelines/cppcoreguidelines.ProTypeUnionAccessCheck.o
[148/1798] CXX obj/clang-tools-extra/clang-tidy/darwin/darwin.AvoidSpinlockCheck.o
[149/1798] CXX obj/clang-tools-extra/clang-tidy/google/google.AvoidCStyleCastsCheck.o
[150/1798] CXX obj/clang-tools-extra/clang-tidy/google/google.AvoidUnderscoreInGoogletestNameCheck.o
[151/1798] CXX obj/clang-tools-extra/clang-tidy/cppcoreguidelines/cppcoreguidelines.ProTypeVarargCheck.o
[152/1798] CXX obj/clang-tools-extra/unittests/clang-doc/ClangDocTests.MDGeneratorTest.o
[153/1798] CXX obj/clang-tools-extra/clang-tidy/misc/misc.UnusedParametersCheck.o
[154/1798] CXX obj/clang-tools-extra/clang-tidy/cppcoreguidelines/cppcoreguidelines.MacroUsageCheck.o
[155/1798] CXX obj/clang-tools-extra/clang-tidy/fuchsia/fuchsia.FuchsiaTidyModule.o
[156/1798] CXX obj/clang-tools-extra/clang-tidy/cppcoreguidelines/cppcoreguidelines.CppCoreGuidelinesTidyModule.o
[157/1798] CXX obj/clang-tools-extra/clang-tidy/cppcoreguidelines/cppcoreguidelines.ProBoundsArrayToPointerDecayCheck.o
[158/1798] CXX obj/clang-tools-extra/clang-tidy/bugprone/bugprone.BranchCloneCheck.o
[159/1798] CXX obj/clang-tools-extra/clang-tidy/cppcoreguidelines/cppcoreguidelines.PreferMemberInitializerCheck.o
[160/1798] CXX obj/clang-tools-extra/clang-tidy/bugprone/bugprone.InaccurateEraseCheck.o
[161/1798] CXX obj/clang-tools-extra/clang-tidy/cppcoreguidelines/cppcoreguidelines.RvalueReferenceParamNotMovedCheck.o
[162/1798] CXX obj/clang-tools-extra/clang-tidy/bugprone/bugprone.IncorrectEnableIfCheck.o
[163/1798] CXX obj/clang-tools-extra/clang-tidy/bugprone/bugprone.IncorrectRoundingsCheck.o
[164/1798] CXX obj/clang-tools-extra/clang-tidy/bugprone/bugprone.StringviewNullptrCheck.o
[165/1798] CXX obj/clang-tools-extra/clang-tidy/bugprone/bugprone.IncDecInConditionsCheck.o
[166/1798] CXX obj/clang-tools-extra/clang-tidy/cppcoreguidelines/cppcoreguidelines.NoSuspendWithLockCheck.o
[167/1798] CXX obj/clang-tools-extra/clang-tidy/bugprone/bugprone.ImplicitWideningOfMultiplicationResultCheck.o
[168/1798] CXX obj/clang-tools-extra/clang-tidy/bugprone/bugprone.IncorrectEnableSharedFromThisCheck.o
[169/1798] CXX obj/clang-tools-extra/clang-tidy/cppcoreguidelines/cppcoreguidelines.ProTypeMemberInitCheck.o
[170/1798] CXX obj/clang/unittests/Sema/SemaTests.SemaNoloadLookupTest.o
[171/1798] CXX obj/clang-tools-extra/clang-tidy/bugprone/bugprone.BugproneTidyModule.o
[172/1798] CXX obj/clang-tools-extra/clang-tidy/cppcoreguidelines/cppcoreguidelines.MissingStdForwardCheck.o
[173/1798] CXX obj/clang-tools-extra/clang-tidy/cppcoreguidelines/cppcoreguidelines.ProBoundsConstantArrayIndexCheck.o
[174/1798] CXX obj/clang-tools-extra/clang-tidy/bugprone/bugprone.IntegerDivisionCheck.o
[175/1798] CXX obj/clang-tools-extra/clang-tidy/bugprone/bugprone.MisplacedWideningCastCheck.o
[176/1798] CXX obj/clang-tools-extra/clang-tidy/bugprone/bugprone.MultiLevelImplicitPointerConversionCheck.o
[177/1798] CXX obj/clang-tools-extra/clang-tidy/bugprone/bugprone.MacroParenthesesCheck.o
[178/1798] CXX obj/clang-tools-extra/clang-tidy/bugprone/bugprone.LambdaFunctionNameCheck.o
[179/1798] CXX obj/clang-tools-extra/clang-tidy/bugprone/bugprone.MisplacedPointerArithmeticInAllocCheck.o
[180/1798] CXX obj/clang-tools-extra/clang-tidy/bugprone/bugprone.MisplacedOperatorInStrlenInAllocCheck.o
[181/1798] CXX obj/clang-tools-extra/clang-tidy/bugprone/bugprone.MoveForwardingReferenceCheck.o
[182/1798] CXX obj/clang-tools-extra/clang-tidy/cppcoreguidelines/cppcoreguidelines.OwningMemoryCheck.o
[183/1798] CXX obj/clang/unittests/Interpreter/ClangReplInterpreterTests.CodeCompletionTest.o
[184/1798] CXX obj/clang-tools-extra/clang-tidy/bugprone/bugprone.MacroRepeatedSideEffectsCheck.o
[185/1798] CXX obj/clang-tools-extra/clang-tidy/bugprone/bugprone.MultipleStatementMacroCheck.o
[186/1798] CXX obj/clang-tools-extra/clang-tidy/bugprone/bugprone.MultipleNewInOneExpressionCheck.o
[187/1798] CXX obj/clang-tools-extra/clang-tidy/bugprone/bugprone.InfiniteLoopCheck.o
[188/1798] CXX obj/clang-tools-extra/clang-tidy/bugprone/bugprone.NoEscapeCheck.o
[189/1798] CXX obj/clang-tools-extra/clang-tidy/bugprone/bugprone.SharedPtrArrayMismatchCheck.o
[190/1798] CXX obj/clang-tools-extra/clang-tidy/bugprone/bugprone.NarrowingConversionsCheck.o
[191/1798] CXX obj/clang-tools-extra/clang-tidy/bugprone/bugprone.ParentVirtualCallCheck.o
[192/1798] CXX obj/clang-tools-extra/clang-tidy/bugprone/bugprone.NonZeroEnumToBoolConversionCheck.o
[193/1798] CXX obj/clang-tools-extra/clang-tidy/bugprone/bugprone.ReservedIdentifierCheck.o
[194/1798] CXX obj/clang-tools-extra/clang-tidy/bugprone/bugprone.PointerArithmeticOnPolymorphicObjectCheck.o
[195/1798] CXX obj/clang-tools-extra/clang-tidy/bugprone/bugprone.NondeterministicPointerIterationOrderCheck.o
[196/1798] CXX obj/clang-tools-extra/clang-tidy/bugprone/bugprone.ReturnConstRefFromParameterCheck.o
[197/1798] CXX obj/clang-tools-extra/clang-tidy/bugprone/bugprone.RedundantBranchConditionCheck.o
[198/1798] CXX obj/clang-tools-extra/clang-tidy/bugprone/bugprone.PosixReturnCheck.o
[199/1798] CXX obj/clang-tools-extra/clang-tidy/bugprone/bugprone.SizeofContainerCheck.o
[200/1798] CXX obj/clang-tools-extra/clang-tidy/bugprone/bugprone.SuspiciousMemoryComparisonCheck.o
[201/1798] CXX obj/clang-tools-extra/clang-tidy/bugprone/bugprone.SignalHandlerCheck.o
[202/1798] CXX obj/clang-tools-extra/clang-tidy/bugprone/bugprone.OptionalValueConversionCheck.o
[203/1798] CXX obj/clang-tools-extra/clang-tidy/bugprone/bugprone.EasilySwappableParametersCheck.o
[204/1798] CXX obj/clang-tools-extra/clang-tidy/bugprone/bugprone.SmartPtrArrayMismatchCheck.o
[205/1798] CXX obj/clang-tools-extra/clang-tidy/bugprone/bugprone.SwitchMissingDefaultCaseCheck.o
[206/1798] CXX obj/clang-tools-extra/clang-tidy/bugprone/bugprone.SuspiciousMemsetUsageCheck.o
[207/1798] CXX obj/clang-tools-extra/clang-tidy/bugprone/bugprone.SignedCharMisuseCheck.o
[208/1798] CXX obj/clang-tools-extra/clang-tidy/bugprone/bugprone.SwappedArgumentsCheck.o
[209/1798] CXX obj/clang-tools-extra/clang-tidy/bugprone/bugprone.SuspiciousSemicolonCheck.o
[210/1798] CXX obj/clang-tools-extra/clang-tidy/bugprone/bugprone.SuspiciousMissingCommaCheck.o
[211/1798] CXX obj/clang-tools-extra/clang-tidy/bugprone/bugprone.StandaloneEmptyCheck.o
[212/1798] CXX obj/clang-tools-extra/clang-tidy/bugprone/bugprone.UndefinedMemoryManipulationCheck.o
[213/1798] CXX obj/clang-tools-extra/clang-tidy/bugprone/bugprone.TaggedUnionMemberCountCheck.o
[214/1798] CXX obj/clang-tools-extra/clang-tidy/bugprone/bugprone.SpuriouslyWakeUpFunctionsCheck.o
[215/1798] CXX obj/clang-tools-extra/clang-tidy/bugprone/bugprone.TerminatingContinueCheck.o
[216/1798] CXX obj/clang-tools-extra/clang-tidy/bugprone/bugprone.ThrowKeywordMissingCheck.o
[217/1798] CXX obj/clang-tools-extra/clang-tidy/bugprone/bugprone.UniquePtrArrayMismatchCheck.o
[218/1798] CXX obj/clang-tools-extra/clang-tidy/bugprone/bugprone.UndelegatedConstructorCheck.o
[219/1798] CXX obj/clang-tools-extra/clang-tidy/bugprone/bugprone.UnintendedCharOstreamOutputCheck.o
[220/1798] CXX obj/clang-tools-extra/clang-tidy/bugprone/bugprone.TooSmallLoopVariableCheck.o
[221/1798] CXX obj/clang-tools-extra/clang-tidy/bugprone/bugprone.SuspiciousReallocUsageCheck.o
[222/1798] CXX obj/clang-tools-extra/clang-tidy/bugprone/bugprone.StringConstructorCheck.o
[223/1798] CXX obj/clang-tools-extra/clang-tidy/bugprone/bugprone.SuspiciousStringviewDataUsageCheck.o
[224/1798] CXX obj/clang-tools-extra/clang-tidy/bugprone/bugprone.UnhandledExceptionAtNewCheck.o
[225/1798] CXX obj/clang-tools-extra/clang-tidy/bugprone/bugprone.SuspiciousStringCompareCheck.o
[226/1798] CXX obj/clang-tools-extra/clang-tidy/bugprone/bugprone.UnusedLocalNonTrivialVariableCheck.o
[227/1798] CXX obj/clang-tools-extra/clang-tidy/bugprone/bugprone.SizeofExpressionCheck.o
[228/1798] CXX obj/clang-tools-extra/clang-tidy/cppcoreguidelines/cppcoreguidelines.AvoidDoWhileCheck.o
[229/1798] CXX obj/clang-tools-extra/clang-tidy/bugprone/bugprone.UnusedRaiiCheck.o
[230/1798] CXX obj/clang-tools-extra/clang-tidy/fuchsia/fuchsia.StaticallyConstructedObjectsCheck.o
[231/1798] CXX obj/clang-tools-extra/clang-tidy/concurrency/concurrency.ConcurrencyTidyModule.o
[232/1798] CXX obj/clang-tools-extra/clang-tidy/cppcoreguidelines/cppcoreguidelines.AvoidGotoCheck.o
[233/1798] CXX obj/clang-tools-extra/clang-tidy/cppcoreguidelines/cppcoreguidelines.AvoidCapturingLambdaCoroutinesCheck.o
[234/1798] CXX obj/clang-tools-extra/clang-tidy/bugprone/bugprone.UncheckedOptionalAccessCheck.o
[235/1798] CXX obj/clang-tools-extra/clang-tidy/bugprone/bugprone.UnsafeFunctionsCheck.o
[236/1798] CXX obj/clang-tools-extra/clang-tidy/bugprone/bugprone.UnusedReturnValueCheck.o
[237/1798] CXX obj/clang-tools-extra/clang-tidy/cppcoreguidelines/cppcoreguidelines.AvoidConstOrRefDataMembersCheck.o
[238/1798] CXX obj/clang-tools-extra/clang-tidy/cppcoreguidelines/cppcoreguidelines.InterfacesGlobalInitCheck.o
[239/1798] CXX obj/clang-tools-extra/clang-tidy/concurrency/concurrency.ThreadCanceltypeAsynchronousCheck.o
[240/1798] CXX obj/clang-tools-extra/clang-tidy/concurrency/concurrency.MtUnsafeCheck.o
[241/1798] CXX obj/clang-tools-extra/clang-tidy/bugprone/bugprone.VirtualNearMissCheck.o
[242/1798] CXX obj/clang-tools-extra/clang-tidy/cert/cert.CERTTidyModule.o
[243/1798] CXX obj/clang-tools-extra/clang-tidy/bugprone/bugprone.UnhandledSelfAssignmentCheck.o
[244/1798] CXX obj/clang-tools-extra/clang-tidy/cert/cert.DefaultOperatorNewAlignmentCheck.o
[245/1798] CXX obj/clang-tools-extra/clang-tidy/cert/cert.LimitedRandomnessCheck.o
[246/1798] CXX obj/clang-tools-extra/clang-tidy/cert/cert.FloatLoopCounter.o
[247/1798] CXX obj/clang-tools-extra/clang-tidy/bugprone/bugprone.NotNullTerminatedResultCheck.o
[248/1798] CXX obj/clang-tools-extra/clang-tidy/cert/cert.CommandProcessorCheck.o
[249/1798] CXX obj/clang-tools-extra/clang-tidy/cppcoreguidelines/cppcoreguidelines.InitVariablesCheck.o
[250/1798] CXX obj/clang-tools-extra/clang-tidy/cert/cert.DontModifyStdNamespaceCheck.o
[251/1798] CXX obj/clang-tools-extra/clang-tidy/cert/cert.NonTrivialTypesLibcMemoryCallsCheck.o
[252/1798] CXX obj/clang-tools-extra/clang-tidy/bugprone/bugprone.UseAfterMoveCheck.o
[253/1798] CXX obj/clang-tools-extra/clang-tidy/cert/cert.MutatingCopyCheck.o
[254/1798] CXX obj/clang-tools-extra/clang-tidy/cert/cert.ProperlySeededRandomGeneratorCheck.o
[255/1798] CXX obj/clang-tools-extra/clang-tidy/fuchsia/fuchsia.DefaultArgumentsDeclarationsCheck.o
[256/1798] CXX obj/clang-tools-extra/clang-tidy/cert/cert.StrToNumCheck.o
[257/1798] CXX obj/clang-tools-extra/clang-tidy/cert/cert.VariadicFunctionDefCheck.o
[258/1798] CXX obj/clang-tools-extra/clang-tidy/llvmlibc/llvmlibc.InlineFunctionDeclCheck.o
[259/1798] CXX obj/clang-tools-extra/clang-tidy/cert/cert.StaticObjectExceptionCheck.o
[260/1798] CXX obj/clang-tools-extra/clang-tidy/cppcoreguidelines/cppcoreguidelines.MisleadingCaptureDefaultByValueCheck.o
[261/1798] CXX obj/clang-tools-extra/clang-tidy/cert/cert.ThrownExceptionTypeCheck.o
[262/1798] CXX obj/clang-tools-extra/clang-tidy/cppcoreguidelines/cppcoreguidelines.NoMallocCheck.o
[263/1798] CXX obj/clang-tools-extra/clang-tidy/hicpp/hicpp.IgnoredRemoveResultCheck.o
[264/1798] CXX obj/clang-tools-extra/clang-tidy/hicpp/hicpp.NoAssemblerCheck.o
[265/1798] CXX obj/clang-tools-extra/clang-tidy/google/google.DefaultArgumentsCheck.o
[266/1798] CXX obj/clang-tools-extra/clang-tidy/hicpp/hicpp.MultiwayPathsCoveredCheck.o
[267/1798] CXX obj/clang-tools-extra/clang-tidy/fuchsia/fuchsia.DefaultArgumentsCallsCheck.o
[268/1798] CXX obj/clang-tools-extra/clang-tidy/darwin/darwin.DispatchOnceNonstaticCheck.o
[269/1798] CXX obj/clang-tools-extra/clang-tidy/darwin/darwin.DarwinTidyModule.o
[270/1798] CXX obj/clang-tools-extra/clang-tidy/cert/cert.SetLongJmpCheck.o
[271/1798] CXX obj/clang-tools-extra/clang-tidy/hicpp/hicpp.ExceptionBaseclassCheck.o
[272/1798] CXX obj/clang-tools-extra/clang-tidy/google/google.UsingNamespaceDirectiveCheck.o
[273/1798] CXX obj/clang-tools-extra/clang-tidy/google/google.UnnamedNamespaceInHeaderCheck.o
[274/1798] CXX obj/clang-tools-extra/clang-tidy/google/google.OverloadedUnaryAndCheck.o
[275/1798] CXX obj/clang-tools-extra/clang-tidy/hicpp/hicpp.SignedBitwiseCheck.o
[276/1798] CXX obj/clang-tools-extra/clang-tidy/hicpp/hicpp.HICPPTidyModule.o
[277/1798] CXX obj/clang-tools-extra/clang-tidy/google/google.GlobalVariableDeclarationCheck.o
[278/1798] CXX obj/clang-tools-extra/clang-tidy/google/google.IntegerTypesCheck.o
[279/1798] CXX obj/clang-tools-extra/clang-tidy/google/google.GlobalNamesInHeadersCheck.o
[280/1798] CXX obj/clang-tools-extra/clang-tidy/google/google.GoogleTidyModule.o
[281/1798] CXX obj/clang-tools-extra/clang-tidy/google/google.FunctionNamingCheck.o
[282/1798] CXX obj/clang-tools-extra/clang-tidy/google/google.AvoidThrowingObjCExceptionCheck.o
[283/1798] CXX obj/clang-tools-extra/clang-tidy/fuchsia/fuchsia.MultipleInheritanceCheck.o
[284/1798] CXX obj/clang-tools-extra/clang-tidy/google/google.ExplicitMakePairCheck.o
[285/1798] CXX obj/clang-tools-extra/clang-tidy/misc/misc.NonPrivateMemberVariablesInClassesCheck.o
[286/1798] CXX obj/clang-tools-extra/clang-tidy/llvmlibc/llvmlibc.CalleeNamespaceCheck.o
[287/1798] CXX obj/clang-tools-extra/clang-tidy/llvmlibc/llvmlibc.ImplementationInNamespaceCheck.o
[288/1798] CXX obj/clang-tools-extra/clang-tidy/llvm/llvm.HeaderGuardCheck.o
[289/1798] CXX obj/clang-tools-extra/clang-tidy/google/google.ExplicitConstructorCheck.o
[290/1798] CXX obj/clang-tools-extra/clang-tidy/llvmlibc/llvmlibc.LLVMLibcTidyModule.o
[291/1798] CXX obj/clang/lib/ASTMatchers/Dynamic/Dynamic.Parser.o
[292/1798] CXX obj/clang-tools-extra/clang-tidy/google/google.TodoCommentCheck.o
[293/1798] CXX obj/clang-tools-extra/clang-tidy/misc/misc.CoroutineHostileRAIICheck.o
[294/1798] CXX obj/clang-tools-extra/clang-tidy/misc/misc.MisleadingIdentifier.o
[295/1798] CXX obj/clang-tools-extra/clang-tidy/linuxkernel/linuxkernel.MustCheckErrsCheck.o
[296/1798] CXX obj/clang/lib/ASTMatchers/Dynamic/Dynamic.VariantValue.o
[297/1798] CXX obj/clang-tools-extra/clang-tidy/misc/misc.NewDeleteOverloadsCheck.o
[298/1798] CXX obj/clang-tools-extra/clang-tidy/llvm/llvm.LLVMTidyModule.o
[299/1798] CXX obj/clang-tools-extra/clang-tidy/linuxkernel/linuxkernel.LinuxKernelTidyModule.o
[300/1798] CXX obj/clang-tools-extra/clang-tidy/llvm/llvm.PreferRegisterOverUnsignedCheck.o
[301/1798] CXX obj/clang-tools-extra/clang-tidy/google/google.UpgradeGoogletestCaseCheck.o
[302/1798] CXX obj/clang-tools-extra/clang-tidy/misc/misc.ConfusableIdentifierCheck.o
[303/1798] CXX obj/clang-tools-extra/clang-tidy/llvmlibc/llvmlibc.RestrictSystemLibcHeadersCheck.o
[304/1798] CXX obj/clang-tools-extra/clang-tidy/llvm/llvm.TwineLocalCheck.o
[305/1798] CXX obj/clang-tools-extra/clang-tidy/misc/misc.MisplacedConstCheck.o
[306/1798] CXX obj/clang-tools-extra/clang-tidy/llvm/llvm.PreferIsaOrDynCastInConditionalsCheck.o
[307/1798] CXX obj/clang-tools-extra/clang-tidy/misc/misc.RedundantExpressionCheck.o
[308/1798] CXX obj/clang-tools-extra/clang-tidy/misc/misc.UseAnonymousNamespaceCheck.o
[309/1798] CXX obj/clang-tools-extra/clang-tidy/misc/misc.MiscTidyModule.o
[310/1798] CXX obj/clang-tools-extra/clang-tidy/modernize/modernize.ConcatNestedNamespacesCheck.o
[311/1798] CXX obj/clang-tools-extra/clang-tidy/llvm/llvm.IncludeOrderCheck.o
[312/1798] CXX obj/clang-tools-extra/clang-tidy/misc/misc.UseInternalLinkageCheck.o
[313/1798] CXX obj/clang-tools-extra/clang-tidy/modernize/modernize.MakeSharedCheck.o
[314/1798] CXX obj/clang-tools-extra/clang-tidy/modernize/modernize.UseDesignatedInitializersCheck.o
[315/1798] CXX obj/clang-tools-extra/unittests/clang-tidy/ClangTidyTests.ModernizeModuleTest.o
[316/1798] CXX obj/clang-tools-extra/unittests/clang-query/ClangQueryTests.QueryEngineTest.o
[317/1798] CXX obj/clang-tools-extra/unittests/clang-tidy/ClangTidyTests.UsingInserterTest.o
[318/1798] CXX obj/clang-tools-extra/clang-tidy/modernize/modernize.UseEqualsDeleteCheck.o
[319/1798] CXX obj/clang-tools-extra/clang-tidy/modernize/modernize.DeprecatedIosBaseAliasesCheck.o
[320/1798] CXX obj/clang-tools-extra/clang-tidy/modernize/modernize.UseRangesCheck.o
[321/1798] CXX obj/clang-tools-extra/clang-tidy/modernize/modernize.MacroToEnumCheck.o
[322/1798] CXX obj/clang-tools-extra/clang-tidy/misc/misc.NoRecursionCheck.o
[323/1798] CXX obj/clang-tools-extra/clang-tidy/modernize/modernize.AvoidBindCheck.o
[324/1798] CXX obj/clang-tools-extra/clang-tidy/modernize/modernize.UseNodiscardCheck.o
[325/1798] CXX obj/clang-tools-extra/clang-tidy/modernize/modernize.UseOverrideCheck.o
[326/1798] CXX obj/clang-tools-extra/unittests/clang-tidy/ClangTidyTests.ReadabilityModuleTest.o
[327/1798] CXX obj/clang-tools-extra/clang-tidy/modernize/modernize.UseNoexceptCheck.o
[328/1798] CXX obj/clang-tools-extra/clang-tidy/modernize/modernize.UseIntegerSignComparisonCheck.o
[329/1798] CXX obj/clang-tools-extra/clang-tidy/misc/misc.ConstCorrectnessCheck.o
[330/1798] CXX obj/clang-tools-extra/clang-tidy/misc/misc.NonCopyableObjects.o
[331/1798] CXX obj/clang-tools-extra/clang-tidy/modernize/modernize.UseStdFormatCheck.o
[332/1798] CXX obj/clang-tools-extra/clang-tidy/modernize/modernize.UseTransparentFunctorsCheck.o
[333/1798] CXX obj/clang/unittests/Frontend/FrontendTests.OutputStreamTest.o
[334/1798] CXX obj/clang-tools-extra/clang-tidy/modernize/modernize.MakeUniqueCheck.o
[335/1798] CXX obj/clang-tools-extra/clang-tidy/modernize/modernize.AvoidCArraysCheck.o
[336/1798] CXX obj/clang-tools-extra/clang-tidy/performance/performance.NoexceptFunctionBaseCheck.o
[337/1798] CXX obj/clang-tools-extra/unittests/clang-tidy/ClangTidyTests.IncludeInserterTest.o
[338/1798] CXX obj/clang-tools-extra/clang-tidy/performance/performance.NoexceptMoveConstructorCheck.o
[339/1798] CXX obj/clang-tools-extra/clang-tidy/modernize/modernize.UseStdPrintCheck.o
[340/1798] CXX obj/clang-tools-extra/clang-tidy/performance/performance.NoexceptSwapCheck.o
[341/1798] CXX obj/clang-tools-extra/clang-tidy/modernize/modernize.UseEqualsDefaultCheck.o
[342/1798] CXX obj/clang-tools-extra/clang-tidy/utils/utils.ExceptionAnalyzer.o
[343/1798] CXX obj/clang-tools-extra/clang-tidy/modernize/modernize.UseEmplaceCheck.o
[344/1798] CXX obj/clang-tools-extra/clang-tidy/modernize/modernize.UseStdNumbersCheck.o
[345/1798] CXX obj/clang-tools-extra/clang-tidy/modernize/modernize.UseStartsEndsWithCheck.o
[346/1798] CXX obj/clang-tools-extra/clang-tidy/performance/performance.TriviallyDestructibleCheck.o
[347/1798] CXX obj/clang-tools-extra/clang-tidy/modernize/modernize.MinMaxUseInitializerListCheck.o
[348/1798] CXX obj/clang-tools-extra/clang-tidy/portability/portability.TemplateVirtualMemberFunctionCheck.o
[349/1798] CXX obj/clang-tools-extra/clang-tidy/portability/portability.SIMDIntrinsicsCheck.o
[350/1798] CXX obj/clang-tools-extra/clang-tidy/modernize/modernize.RawStringLiteralCheck.o
[351/1798] CXX obj/clang-tools-extra/clang-tidy/performance/performance.PerformanceTidyModule.o
[352/1798] CXX obj/clang-tools-extra/clang-tidy/portability/portability.StdAllocatorConstCheck.o
[353/1798] CXX obj/clang/unittests/Interpreter/ExceptionTests/ClangReplInterpreterExceptionTests.InterpreterExceptionTest.o
[354/1798] CXX obj/clang-tools-extra/unittests/clang-tidy/ClangTidyTests.TransformerClangTidyCheckTest.o
[355/1798] CXX obj/clang-tools-extra/clang-tidy/performance/performance.InefficientVectorOperationCheck.o
[356/1798] CXX obj/clang-tools-extra/clang-tidy/modernize/modernize.MakeSmartPtrCheck.o
[357/1798] CXX obj/clang-tools-extra/clang-tidy/readability/readability.AmbiguousSmartptrResetCallCheck.o
[358/1798] CXX obj/clang-tools-extra/clang-tidy/performance/performance.ForRangeCopyCheck.o
[359/1798] CXX obj/clang/lib/CodeGen/CodeGen.CGCUDANV.o
[360/1798] CXX obj/clang-tools-extra/clang-tidy/performance/performance.UnnecessaryCopyInitialization.o
[361/1798] CXX obj/clang-tools-extra/clang-tidy/performance/performance.TypePromotionInMathFnCheck.o
[362/1798] CXX obj/clang-tools-extra/clang-tidy/modernize/modernize.ModernizeTidyModule.o
[363/1798] CXX obj/clang-tools-extra/clang-tidy/modernize/modernize.TypeTraitsCheck.o
[364/1798] CXX obj/clang-tools-extra/clang-tidy/modernize/modernize.ShrinkToFitCheck.o
[365/1798] CXX obj/clang-tools-extra/clang-tidy/modernize/modernize.UnaryStaticAssertCheck.o
[366/1798] CXX obj/clang-tools-extra/clang-tidy/modernize/modernize.RedundantVoidArgCheck.o
[367/1798] CXX obj/clang-tools-extra/clang-tidy/modernize/modernize.ReturnBracedInitListCheck.o
[368/1798] CXX obj/clang-tools-extra/clang-tidy/modernize/modernize.ReplaceDisallowCopyAndAssignMacroCheck.o
[369/1798] CXX obj/clang-tools-extra/clang-tidy/performance/performance.UnnecessaryValueParamCheck.o
[370/1798] CXX obj/clang/lib/StaticAnalyzer/Core/Core.HTMLDiagnostics.o
[371/1798] CXX obj/clang-tools-extra/clang-tidy/modernize/modernize.ReplaceRandomShuffleCheck.o
[372/1798] CXX obj/clang-tools-extra/clang-tidy/modernize/modernize.UseBoolLiteralsCheck.o
[373/1798] CXX obj/clang-tools-extra/clang-tidy/objc/objc.PropertyDeclarationCheck.o
[374/1798] CXX obj/clang-tools-extra/clang-tidy/modernize/modernize.ReplaceAutoPtrCheck.o
[375/1798] CXX obj/clang-tools-extra/clang-tidy/objc/objc.SuperSelfCheck.o
[376/1798] CXX obj/clang-tools-extra/clang-tidy/modernize/modernize.UseConstraintsCheck.o
[377/1798] CXX obj/clang-tools-extra/clang-tidy/objc/objc.NSDateFormatterCheck.o
[378/1798] CXX obj/clang-tools-extra/clang-tidy/objc/objc.DeallocInCategoryCheck.o
[379/1798] CXX obj/clang-tools-extra/clang-tidy/objc/objc.ObjCTidyModule.o
[380/1798] CXX obj/clang-tools-extra/clang-tidy/objc/objc.MissingHashCheck.o
[381/1798] CXX obj/clang-tools-extra/clang-tidy/openmp/openmp.OpenMPTidyModule.o
[382/1798] CXX obj/clang-tools-extra/clang-tidy/objc/objc.NSInvocationArgumentLifetimeCheck.o
[383/1798] CXX obj/clang-tools-extra/clang-tidy/openmp/openmp.UseDefaultNoneCheck.o
[384/1798] CXX obj/clang-tools-extra/clang-tidy/modernize/modernize.UseDefaultMemberInitCheck.o
[385/1798] CXX obj/clang-tools-extra/clang-tidy/portability/portability.PortabilityTidyModule.o
[386/1798] CXX obj/clang-tools-extra/clang-tidy/portability/portability.RestrictSystemIncludesCheck.o
[387/1798] CXX obj/clang-tools-extra/clang-tidy/performance/performance.FasterStringFindCheck.o
[388/1798] CXX obj/clang-tools-extra/clang-tidy/openmp/openmp.ExceptionEscapeCheck.o
[389/1798] CXX obj/clang-tools-extra/clang-tidy/performance/performance.MoveConstructorInitCheck.o
[390/1798] CXX obj/clang-tools-extra/clang-tidy/modernize/modernize.UseAutoCheck.o
[391/1798] CXX obj/clang-tools-extra/clang-tidy/performance/performance.ImplicitConversionInLoopCheck.o
[392/1798] CXX obj/clang-tools-extra/clang-tidy/performance/performance.AvoidEndlCheck.o
[393/1798] CXX obj/clang-tools-extra/clang-tidy/performance/performance.NoIntToPtrCheck.o
[394/1798] CXX obj/clang-tools-extra/clang-tidy/readability/readability.AvoidNestedConditionalOperatorCheck.o
[395/1798] CXX obj/clang-tools-extra/clang-tidy/performance/performance.NoexceptDestructorCheck.o
[396/1798] CXX obj/clang-tools-extra/clang-tidy/performance/performance.InefficientStringConcatenationCheck.o
[397/1798] CXX obj/clang-tools-extra/clang-tidy/performance/performance.EnumSizeCheck.o
[398/1798] CXX obj/clang-tools-extra/clang-tidy/performance/performance.InefficientAlgorithmCheck.o
[399/1798] CXX obj/clang-tools-extra/clang-tidy/performance/performance.NoAutomaticMoveCheck.o
[400/1798] CXX obj/clang-tools-extra/clang-tidy/performance/performance.MoveConstArgCheck.o
[401/1798] CXX obj/clang-tools-extra/clang-tidy/readability/readability.DeleteNullPointerCheck.o
[402/1798] CXX obj/clang-tools-extra/clang-tidy/readability/readability.ContainerDataPointerCheck.o
[403/1798] CXX obj/clang-tools-extra/clang-tidy/readability/readability.EnumInitialValueCheck.o
[404/1798] CXX obj/clang-tools-extra/clang-tidy/readability/readability.ContainerContainsCheck.o
[405/1798] CXX obj/clang-tools-extra/clang-tidy/modernize/modernize.DeprecatedHeadersCheck.o
[406/1798] CXX obj/clang-tools-extra/clang-tidy/readability/readability.InconsistentDeclarationParameterNameCheck.o
[407/1798] CXX obj/clang-tools-extra/clang-tidy/readability/readability.IdentifierLengthCheck.o
[408/1798] CXX obj/clang-tools-extra/clang-tidy/readability/readability.IsolateDeclarationCheck.o
[409/1798] CXX obj/clang-tools-extra/clang-tidy/modernize/modernize.UseTrailingReturnTypeCheck.o
[410/1798] CXX obj/clang-tools-extra/clang-tidy/readability/readability.MathMissingParenthesesCheck.o
[411/1798] CXX obj/clang-tools-extra/clang-tidy/readability/readability.ElseAfterReturnCheck.o
[412/1798] CXX obj/clang-tools-extra/clang-tidy/readability/readability.MagicNumbersCheck.o
[413/1798] CXX obj/clang-tools-extra/clang-tidy/readability/readability.DuplicateIncludeCheck.o
[414/1798] CXX obj/clang-tools-extra/clang-tidy/readability/readability.AvoidReturnWithVoidValueCheck.o
[415/1798] CXX obj/clang-tools-extra/clang-tidy/utils/utils.ASTUtils.o
[416/1798] CXX obj/clang-tools-extra/clang-tidy/utils/utils.LexerUtils.o
[417/1798] CXX obj/clang-tools-extra/clang-tidy/readability/readability.ConstReturnTypeCheck.o
[418/1798] CXX obj/clang-tools-extra/clang-tidy/readability/readability.AvoidUnconditionalPreprocessorIfCheck.o
[419/1798] CXX obj/clang-tools-extra/clang-tidy/modernize/modernize.PassByValueCheck.o
[420/1798] CXX obj/clang-tools-extra/clang-tidy/readability/readability.ImplicitBoolConversionCheck.o
[421/1798] CXX obj/clang-tools-extra/clangd/clangd.Compiler.o
[422/1798] CXX obj/clang-tools-extra/clangd/clangd.CollectMacros.o
[423/1798] CXX obj/clang-tools-extra/clang-tidy/readability/readability.BracesAroundStatementsCheck.o
[424/1798] CXX obj/clang-tools-extra/clang-tidy/readability/readability.IdentifierNamingCheck.o
[425/1798] CXX obj/clang-tools-extra/clang-tidy/readability/readability.AvoidConstParamsInDecls.o
[426/1798] CXX obj/clang-tools-extra/clangd/clangd.ASTSignals.o
[427/1798] CXX obj/clang-tools-extra/clang-tidy/zircon/zircon.ZirconTidyModule.o
[428/1798] CXX obj/clang-tools-extra/clang-tidy/zircon/zircon.TemporaryObjectsCheck.o
[429/1798] CXX obj/clang-tools-extra/clang-tidy/readability/readability.ContainerSizeEmptyCheck.o
[430/1798] CXX obj/clang-tools-extra/clang-tidy/utils/utils.IncludeSorter.o
[431/1798] CXX obj/clang-tools-extra/clang-tidy/utils/utils.Matchers.o
[432/1798] CXX obj/clang-tools-extra/clang-tidy/readability/readability.MisplacedArrayIndexCheck.o
[433/1798] CXX obj/clang-tools-extra/clang-tidy/readability/readability.MisleadingIndentationCheck.o
[434/1798] CXX obj/clang-tools-extra/clang-tidy/utils/utils.IncludeInserter.o
[435/1798] CXX obj/clang-tools-extra/clang-tidy/readability/readability.NamespaceCommentCheck.o
[436/1798] CXX obj/clang-tools-extra/clangd/unittests/ClangdTests.ASTSignalsTests.o
[437/1798] CXX obj/clang-tools-extra/clangd/clangd.CompileCommands.o
[438/1798] CXX obj/clang-tools-extra/clang-tidy/utils/utils.FormatStringConverter.o
[439/1798] CXX obj/clang-tools-extra/clang-tidy/readability/readability.NamedParameterCheck.o
[440/1798] CXX obj/clang-tools-extra/clang-tidy/utils/utils.NamespaceAliaser.o
[441/1798] CXX obj/clang-tools-extra/clang-tidy/readability/readability.RedundantAccessSpecifiersCheck.o
[442/1798] CXX obj/clang-tools-extra/clang-tidy/readability/readability.OperatorsRepresentationCheck.o
[443/1798] CXX obj/clang-tools-extra/clang-tidy/readability/readability.NonConstParameterCheck.o
[444/1798] CXX obj/clang-tools-extra/clang-tidy/utils/utils.FixItHintUtils.o
[445/1798] CXX obj/clang-tools-extra/clang-tidy/utils/utils.Aliasing.o
[446/1798] CXX obj/clang-tools-extra/clang-tidy/readability/readability.RedundantDeclarationCheck.o
[447/1798] CXX obj/clang-tools-extra/clang-tidy/readability/readability.QualifiedAutoCheck.o
[448/1798] CXX obj/clang-tools-extra/clang-tidy/readability/readability.RedundantCastingCheck.o
[449/1798] CXX obj/clang-tools-extra/clang-tidy/utils/utils.HeaderGuard.o
[450/1798] CXX obj/clang-tools-extra/clang-tidy/readability/readability.RedundantControlFlowCheck.o
[451/1798] CXX obj/clang-tools-extra/clang-tidy/readability/readability.RedundantFunctionPtrDereferenceCheck.o
[452/1798] CXX obj/clang-tools-extra/clang-tidy/utils/utils.ExprSequence.o
[453/1798] CXX obj/clang-tools-extra/clang-tidy/readability/readability.RedundantInlineSpecifierCheck.o
[454/1798] CXX obj/clang-tools-extra/clang-tidy/readability/readability.ReadabilityTidyModule.o
[455/1798] CXX obj/clang-tools-extra/clang-tidy/readability/readability.RedundantMemberInitCheck.o
[456/1798] CXX obj/clang-tools-extra/clang-tidy/readability/readability.ReferenceToConstructedTemporaryCheck.o
[457/1798] CXX obj/clang-tools-extra/clang-tidy/readability/readability.StaticDefinitionInAnonymousNamespaceCheck.o
[458/1798] CXX obj/clang-tools-extra/clang-tidy/readability/readability.StaticAccessedThroughInstanceCheck.o
[459/1798] CXX obj/clang-tools-extra/clang-tidy/readability/readability.RedundantStringInitCheck.o
[460/1798] CXX obj/clang-tools-extra/clang-tidy/readability/readability.SimplifySubscriptExprCheck.o
[461/1798] CXX obj/clang-tools-extra/clang-tidy/readability/readability.RedundantPreprocessorCheck.o
[462/1798] CXX obj/clang-tools-extra/clang-tidy/readability/readability.SuspiciousCallArgumentCheck.o
[463/1798] CXX obj/clang-tools-extra/clang-tidy/readability/readability.UniqueptrDeleteReleaseCheck.o
[464/1798] CXX obj/clang-tools-extra/clang-tidy/readability/readability.RedundantSmartptrGetCheck.o
[465/1798] CXX obj/clang-tools-extra/clang-tidy/readability/readability.UppercaseLiteralSuffixCheck.o
[466/1798] CXX obj/clang-tools-extra/clang-tidy/readability/readability.StringCompareCheck.o
[467/1798] CXX obj/clang-tools-extra/clang-tidy/readability/readability.RedundantStringCStrCheck.o
[468/1798] CXX obj/clang-tools-extra/clang-tidy/readability/readability.ConvertMemberFunctionsToStatic.o
[469/1798] CXX obj/clang-tools-extra/clang-tidy/utils/utils.TypeTraits.o
[470/1798] CXX obj/clang-tools-extra/clang-tidy/modernize/modernize.LoopConvertUtils.o
[471/1798] CXX obj/clang-tools-extra/clang-tidy/readability/readability.UseAnyOfAllOfCheck.o
[472/1798] CXX obj/clang-tools-extra/clang-tidy/utils/utils.DeclRefExprUtils.o
[473/1798] CXX obj/clang-tools-extra/clang-tidy/modernize/modernize.LoopConvertCheck.o
[474/1798] CXX obj/clang-tools-extra/clang-tidy/utils/utils.UsingInserter.o
[475/1798] CXX obj/clang-tools-extra/clangd/refactor/tweaks/tweaks.RawStringLiteral.o
[476/1798] CXX obj/clang/lib/Frontend/Frontend.CompilerInvocation.o
[477/1798] CXX obj/clang-tools-extra/clang-tidy/readability/readability.MakeMemberFunctionConstCheck.o
[478/1798] CXX obj/clang-tools-extra/clang-tidy/utils/utils.TransformerClangTidyCheck.o
[479/1798] CXX obj/clang-tools-extra/clangd/clangd.CodeComplete.o
[480/1798] CXX obj/clang-tools-extra/clang-tidy/readability/readability.UseStdMinMaxCheck.o
[481/1798] CXX obj/clang-tools-extra/clangd/refactor/tweaks/tweaks.ScopifyEnum.o
[482/1798] CXX obj/clang-tools-extra/clangd/clangd.ClangdServer.o
[483/1798] CXX obj/clang-tools-extra/clangd/refactor/tweaks/tweaks.SwapIfBranches.o
[484/1798] CXX obj/clang-tools-extra/clangd/refactor/tweaks/tweaks.SwapBinaryOperands.o
[485/1798] CXX obj/clang-tools-extra/clang-tidy/utils/utils.UseRangesCheck.o
[486/1798] CXX obj/clang-tools-extra/clang-tidy/readability/readability.FunctionSizeCheck.o
[487/1798] CXX obj/clang-tools-extra/clang-tidy/readability/readability.FunctionCognitiveComplexityCheck.o
[488/1798] CXX obj/clang-tools-extra/clangd/clangd.DumpAST.o
[489/1798] CXX obj/clang-tools-extra/clangd/clangd.HeaderSourceSwitch.o
[490/1798] CXX obj/clang-tools-extra/clangd/clangd.Headers.o
[491/1798] CXX obj/clang-tools-extra/clangd/clangd.ScanningProjectModules.o
[492/1798] CXX obj/clang-tools-extra/clangd/clangd.GlobalCompilationDatabase.o
[493/1798] CXX obj/clang-tools-extra/clangd/clangd.FindSymbols.o
[494/1798] CXX obj/clang-tools-extra/clangd/refactor/tweaks/tweaks.SpecialMembers.o
[495/1798] CXX obj/clang-tools-extra/clangd/clangd.Quality.o
[496/1798] CXX obj/clang-tools-extra/clangd/refactor/tweaks/tweaks.AnnotateHighlightings.o
[497/1798] CXX obj/clang-tools-extra/clang-tidy/modernize/modernize.UseNullptrCheck.o
[498/1798] CXX obj/clang-tools-extra/clangd/index/clangd.BackgroundQueue.o
[499/1798] CXX obj/clang-tools-extra/clangd/index/clangd.BackgroundIndexLoader.o
[500/1798] CXX obj/clang-tools-extra/clangd/clangd.SemanticSelection.o
[501/1798] CXX obj/clang-tools-extra/clangd/index/clangd.BackgroundRebuild.o
[502/1798] CXX obj/clang-tools-extra/clangd/clangd.ModulesBuilder.o
[503/1798] CXX obj/clang-tools-extra/clangd/clangd.IncludeFixer.o
[504/1798] CXX obj/clang-tools-extra/clangd/tool/clangd.Check.o
[505/1798] CXX obj/clang-tools-extra/clangd/index/clangd.BackgroundIndexStorage.o
[506/1798] CXX obj/clang-tools-extra/clangd/clangd.Hover.o
[507/1798] CXX obj/clang-tools-extra/clangd/clangd.IncludeCleaner.o
[508/1798] CXX obj/clang-tools-extra/clangd/index/clangd.IndexAction.o
[509/1798] CXX obj/clang-tools-extra/clangd/clangd.ClangdLSPServer.o
[510/1798] CXX obj/clang-tools-extra/clangd/index/clangd.YAMLSerialization.o
[511/1798] CXX obj/clang-tools-extra/clangd/index/clangd.Background.o
[512/1798] CXX obj/clang-tools-extra/clang-tidy/readability/readability.SimplifyBooleanExprCheck.o
[513/1798] CXX obj/clang-tools-extra/clangd/refactor/clangd.Tweak.o
[514/1798] CXX obj/clang-tools-extra/clangd/refactor/tweaks/tweaks.MemberwiseConstructor.o
[515/1798] CXX obj/clang-tools-extra/clangd/index/clangd.Serialization.o
[516/1798] CXX obj/clang-tools-extra/clangd/clangd.SourceCode.o
[517/1798] CXX obj/clang-tools-extra/clangd/refactor/tweaks/tweaks.ObjCLocalizeStringLiteral.o
[518/1798] CXX obj/clang-tools-extra/clangd/clangd.AST.o
[519/1798] CXX obj/clang-tools-extra/clangd/refactor/tweaks/tweaks.DefineOutline.o
[520/1798] CXX obj/clang-tools-extra/clangd/refactor/tweaks/tweaks.ExpandDeducedType.o
[521/1798] CXX obj/clang-tools-extra/clangd/refactor/tweaks/tweaks.PopulateSwitch.o
[522/1798] CXX obj/clang-tools-extra/clangd/index/clangd.StdLib.o
[523/1798] CXX obj/clang-tools-extra/clangd/clangd.TUScheduler.o
[524/1798] CXX obj/clang-tools-extra/clangd/refactor/tweaks/tweaks.DumpAST.o
[525/1798] CXX obj/clang-tools-extra/include-cleaner/lib/lib.Record.o
[526/1798] CXX obj/clang-tools-extra/clangd/clangd.Preamble.o
[527/1798] CXX obj/clang-tools-extra/clangd/refactor/tweaks/tweaks.ExpandMacro.o
[528/1798] CXX obj/clang-tools-extra/modularize/modularize.ModularizeUtilities.o
[529/1798] CXX obj/clang-tools-extra/clangd/index/clangd.SymbolCollector.o
[530/1798] CXX obj/clang-tools-extra/clangd/refactor/tweaks/tweaks.ObjCMemberwiseInitializer.o
[531/1798] CXX obj/clang-tools-extra/clangd/indexer/clangd-indexer.IndexerMain.o
[532/1798] CXX obj/clang-tools-extra/clangd/index/clangd.FileIndex.o
[533/1798] CXX obj/clang-tools-extra/clangd/refactor/tweaks/tweaks.DefineInline.o
[534/1798] CXX obj/clang-tools-extra/clangd/refactor/clangd.Rename.o
[535/1798] CXX obj/clang-tools-extra/clangd/unittests/ClangdTests.CompilerTests.o
[536/1798] CXX obj/clang-tools-extra/clangd/unittests/ClangdTests.FeatureModulesTests.o
[537/1798] CXX obj/clang-tools-extra/clang-tidy/utils/utils.RenamerClangTidyCheck.o
[538/1798] CXX obj/clang-tools-extra/clangd/refactor/tweaks/tweaks.RemoveUsingNamespace.o
[539/1798] CXX obj/clang-tools-extra/clangd/clangd.ParsedAST.o
[540/1798] CXX obj/clang-tools-extra/clangd/unittests/ClangdTests.ExpectedTypeTest.o
[541/1798] CXX obj/clang-tools-extra/clangd/unittests/ClangdTests.DumpASTTests.o
[542/1798] CXX obj/clang-tools-extra/clangd/unittests/ClangdTests.HeaderSourceSwitchTests.o
[543/1798] CXX obj/clang-tools-extra/clangd/clangd.FindTarget.o
[544/1798] CXX obj/clang-tools-extra/clangd/unittests/ClangdTests.FindTargetTests.o
[545/1798] CXX obj/clang-tools-extra/unittests/clang-apply-replacements/ClangApplyReplacementsTests.ApplyReplacementsTest.o
[546/1798] CXX obj/clang-tools-extra/clangd/unittests/ClangdTests.InsertionPointTests.o
[547/1798] CXX obj/clang-tools-extra/clangd/unittests/ClangdTests.ASTTests.o
[548/1798] CXX obj/clang-tools-extra/clangd/unittests/ClangdTests.CodeCompletionStringsTests.o
[549/1798] CXX obj/clang-tools-extra/clangd/clangd.Selection.o
[550/1798] CXX obj/clang-tools-extra/clangd/clangd.Diagnostics.o
[551/1798] CXX obj/clang-tools-extra/clangd/unittests/ClangdTests.CollectMacrosTests.o
[552/1798] CXX obj/clang-tools-extra/clangd/clangd.InlayHints.o
[553/1798] CXX obj/clang-tools-extra/clangd/unittests/ClangdTests.IndexActionTests.o
[554/1798] CXX obj/clang-tools-extra/clangd/clangd.SemanticHighlighting.o
[555/1798] CXX obj/clang-tools-extra/clangd/unittests/ClangdTests.HeadersTests.o
[556/1798] CXX obj/clang-tools-extra/clangd/unittests/ClangdTests.ModulesTests.o
[557/1798] CXX obj/clang-tools-extra/clangd/unittests/ClangdTests.IncludeCleanerTests.o
[558/1798] CXX obj/clang-tools-extra/clangd/unittests/ClangdTests.CallHierarchyTests.o
[559/1798] CXX obj/clang-tools-extra/unittests/clang-tidy/ClangTidyTests.GoogleModuleTest.o
[560/1798] CXX obj/clang-tools-extra/clangd/tool/clangd.ClangdMain.o
[561/1798] CXX obj/clang-tools-extra/unittests/clang-tidy/ClangTidyTests.ObjCModuleTest.o
[562/1798] CXX obj/clang-tools-extra/clangd/unittests/ClangdTests.ClangdLSPServerTests.o
[563/1798] CXX obj/clang-tools-extra/clangd/unittests/ClangdTests.TestWorkspace.o
[564/1798] CXX obj/clang-tools-extra/clangd/unittests/ClangdTests.FileIndexTests.o
[565/1798] CXX obj/clang-tools-extra/clangd/unittests/ClangdTests.SemanticHighlightingTests.o
[566/1798] CXX obj/clang-tools-extra/clangd/unittests/ClangdTests.QualityTests.o
[567/1798] CXX obj/clang-tools-extra/unittests/clang-tidy/ClangTidyTests.IncludeCleanerTest.o
[568/1798] CXX obj/clang-tools-extra/clangd/unittests/ClangdTests.PrerequisiteModulesTest.o
[569/1798] CXX obj/clang-tools-extra/clangd/unittests/ClangdTests.HoverTests.o
[570/1798] CXX obj/clang-tools-extra/clangd/unittests/ClangdTests.SymbolInfoTests.o
[571/1798] CXX obj/clang/unittests/AST/ASTTests.ASTDumperTest.o
[572/1798] CXX obj/clang-tools-extra/clangd/refactor/tweaks/tweaks.ExtractVariable.o
[573/1798] CXX obj/clang-tools-extra/clangd/unittests/ClangdTests.SemanticSelectionTests.o
[574/1798] CXX obj/clang-tools-extra/clangd/unittests/ClangdTests.SyncAPI.o
[575/1798] CXX obj/clang/tools/clang-scan-deps/clang-scan-deps.ClangScanDeps.o
[576/1798] CXX obj/clang-tools-extra/clangd/unittests/ClangdTests.SelectionTests.o
[577/1798] CXX obj/clang-tools-extra/clangd/unittests/ClangdTests.InlayHintTests.o
[578/1798] CXX obj/clang-tools-extra/unittests/clang-tidy/ClangTidyTests.LLVMModuleTest.o
[579/1798] CXX obj/clang-tools-extra/clangd/unittests/ClangdTests.IndexTests.o
[580/1798] CXX obj/clang-tools-extra/clangd/unittests/ClangdTests.StdLibTests.o
[581/1798] CXX obj/clang-tools-extra/clangd/unittests/ClangdTests.FindSymbolsTests.o
[582/1798] CXX obj/clang-tools-extra/clangd/unittests/tweaks/ClangdTests.AddUsingTests.o
[583/1798] CXX obj/clang-tools-extra/clangd/unittests/tweaks/ClangdTests.AnnotateHighlightingsTests.o
[584/1798] CXX obj/clang-tools-extra/clangd/unittests/tweaks/ClangdTests.DumpASTTests.o
[585/1798] CXX obj/clang-tools-extra/clangd/unittests/tweaks/ClangdTests.DumpRecordLayoutTests.o
[586/1798] CXX obj/clang-tools-extra/clangd/unittests/ClangdTests.SerializationTests.o
[587/1798] CXX obj/clang-tools-extra/clangd/unittests/tweaks/ClangdTests.DumpSymbolTests.o
[588/1798] CXX obj/clang-tools-extra/clangd/unittests/tweaks/ClangdTests.DefineOutlineTests.o
[589/1798] CXX obj/clang-tools-extra/clangd/unittests/ClangdTests.ReplayPeambleTests.o
[590/1798] CXX obj/clang-tools-extra/clangd/unittests/tweaks/ClangdTests.DefineInlineTests.o
[591/1798] CXX obj/clang-tools-extra/clangd/unittests/ClangdTests.ClangdTests.o
[592/1798] CXX obj/clang-tools-extra/clangd/unittests/tweaks/ClangdTests.ExpandDeducedTypeTests.o
[593/1798] CXX obj/clang-tools-extra/clangd/unittests/ClangdTests.DiagnosticsTests.o
[594/1798] CXX obj/clang-tools-extra/clangd/unittests/tweaks/ClangdTests.ExpandMacroTests.o
[595/1798] CXX obj/clang-tools-extra/clangd/unittests/ClangdTests.RenameTests.o
[596/1798] CXX obj/clang-tools-extra/clangd/unittests/ClangdTests.SourceCodeTests.o
[597/1798] CXX obj/clang-tools-extra/clangd/unittests/tweaks/ClangdTests.ExtractVariableTests.o
[598/1798] CXX obj/clang-tools-extra/clangd/unittests/tweaks/ClangdTests.PopulateSwitchTests.o
[599/1798] CXX obj/clang-tools-extra/clangd/unittests/tweaks/ClangdTests.ExtractFunctionTests.o
[600/1798] CXX obj/clang-tools-extra/clangd/unittests/ClangdTests.BackgroundIndexTests.o
[601/1798] CXX obj/clang-tools-extra/clangd/unittests/ClangdTests.PreambleTests.o
[602/1798] CXX obj/clang-tools-extra/clangd/unittests/ClangdTests.TypeHierarchyTests.o
[603/1798] CXX obj/clang-tools-extra/clangd/unittests/tweaks/ClangdTests.ObjCLocalizeStringLiteralTests.o
[604/1798] CXX obj/clang-tools-extra/clangd/unittests/tweaks/ClangdTests.MemberwiseConstructorTests.o
[605/1798] CXX obj/clang/lib/AST/AST.ExprClassification.o
[606/1798] CXX obj/clang-tools-extra/clangd/unittests/tweaks/ClangdTests.RemoveUsingNamespaceTests.o
[607/1798] CXX obj/clang-tools-extra/clangd/unittests/tweaks/ClangdTests.RawStringLiteralTests.o
[608/1798] CXX obj/clang-tools-extra/pp-trace/pp-trace.PPTrace.o
[609/1798] CXX obj/clang-tools-extra/clangd/unittests/tweaks/ClangdTests.ScopifyEnumTests.o
[610/1798] CXX obj/clang-tools-extra/clangd/unittests/tweaks/ClangdTests.ObjCMemberwiseInitializerTests.o
[611/1798] CXX obj/clang-tools-extra/clangd/unittests/ClangdTests.ParsedASTTests.o
[612/1798] CXX obj/clang-tools-extra/clangd/unittests/tweaks/ClangdTests.ShowSelectionTreeTests.o
[613/1798] CXX obj/clang/lib/Analysis/Analysis.CFGStmtMap.o
[614/1798] CXX obj/clang-tools-extra/clangd/clangd.XRefs.o
[615/1798] CXX obj/clang/lib/Analysis/Analysis.CFGReachabilityAnalysis.o
[616/1798] CXX obj/clang-tools-extra/clangd/unittests/tweaks/ClangdTests.SpecialMembersTests.o
[617/1798] CXX obj/clang/lib/AST/AST.APValue.o
[618/1798] CXX obj/clang-tools-extra/clangd/unittests/tweaks/ClangdTests.SwapBinaryOperandsTests.o
[619/1798] CXX obj/clang/lib/AST/AST.ASTDiagnostic.o
[620/1798] CXX obj/clang-tools-extra/clangd/unittests/tweaks/ClangdTests.SwapIfBranchesTests.o
[621/1798] CXX obj/clang-tools-extra/clangd/unittests/tweaks/ClangdTests.TweakTesting.o
[622/1798] CXX obj/clang-tools-extra/clangd/unittests/ClangdTests.XRefsTests.o
[623/1798] CXX obj/clang-tools-extra/modularize/modularize.CoverageChecker.o
[624/1798] CXX obj/clang/unittests/Sema/SemaTests.SemaLookupTest.o
[625/1798] CXX obj/clang/unittests/Sema/SemaTests.ExternalSemaSourceTest.o
[626/1798] CXX obj/clang-tools-extra/clangd/unittests/tweaks/ClangdTests.TweakTests.o
[627/1798] CXX obj/clang-tools-extra/unittests/clang-include-fixer/ClangIncludeFixerTests.IncludeFixerTest.o
[628/1798] CXX obj/clang/lib/Analysis/Analysis.BodyFarm.o
[629/1798] CXX obj/clang-tools-extra/unittests/clang-query/ClangQueryTests.QueryParserTest.o
[630/1798] CXX obj/clang/lib/Analysis/Analysis.ConstructionContext.o
[631/1798] CXX obj/clang/lib/Analysis/Analysis.CallGraph.o
[632/1798] CXX obj/clang/lib/AST/AST.ASTStructuralEquivalence.o
[633/1798] CXX obj/clang-tools-extra/clangd/unittests/ClangdTests.PrintASTTests.o
[634/1798] CXX obj/clang-tools-extra/unittests/clang-doc/ClangDocTests.GeneratorTest.o
[635/1798] CXX obj/clang-tools-extra/clangd/unittests/ClangdTests.TUSchedulerTests.o
[636/1798] CXX obj/clang/lib/Analysis/Analysis.Dominators.o
[637/1798] CXX obj/clang-tools-extra/unittests/clang-doc/ClangDocTests.ClangDocTest.o
[638/1798] CXX obj/clang-tools-extra/unittests/clang-doc/ClangDocTests.BitcodeTest.o
[639/1798] CXX obj/clang-tools-extra/clangd/refactor/tweaks/tweaks.ExtractFunction.o
[640/1798] CXX obj/clang-tools-extra/clangd/unittests/ClangdTests.TestTU.o
[641/1798] CXX obj/clang-tools-extra/unittests/clang-doc/ClangDocTests.YAMLGeneratorTest.o
[642/1798] CXX obj/clang/lib/Analysis/Analysis.IntervalPartition.o
[643/1798] CXX obj/clang/lib/AST/ByteCode/AST.InterpFrame.o
[644/1798] CXX obj/clang/lib/Analysis/Analysis.AnalysisDeclContext.o
[645/1798] CXX obj/clang-tools-extra/unittests/clang-doc/ClangDocTests.MergeTest.o
[646/1798] CXX obj/clang/lib/ASTMatchers/Dynamic/Dynamic.Registry.o
[647/1798] CXX obj/clang/lib/Analysis/Analysis.CalledOnceCheck.o
[648/1798] CXX obj/clang/lib/AST/ByteCode/AST.Pointer.o
[649/1798] CXX obj/clang-tools-extra/unittests/clang-tidy/ClangTidyTests.NamespaceAliaserTest.o
[650/1798] CXX obj/clang/lib/AST/AST.ComputeDependence.o
[651/1798] CXX obj/clang/lib/Analysis/Analysis.CloneDetection.o
[652/1798] CXX obj/clang-tools-extra/unittests/clang-include-fixer/find-all-symbols/FindAllSymbolsTests.FindAllSymbolsTests.o
[653/1798] CXX obj/clang-tools-extra/unittests/clang-tidy/ClangTidyTests.ClangTidyOptionsTest.o
[654/1798] CXX obj/clang/lib/Analysis/Analysis.Consumed.o
[655/1798] CXX obj/clang/lib/AST/ByteCode/AST.Context.o
[656/1798] CXX obj/clang/lib/AST/AST.DeclTemplate.o
[657/1798] CXX obj/clang/lib/AST/AST.ExternalASTMerger.o
[658/1798] CXX obj/clang-tools-extra/unittests/clang-tidy/ClangTidyTests.ClangTidyDiagnosticConsumerTest.o
[659/1798] CXX obj/clang/lib/AST/AST.ExprCXX.o
[660/1798] CXX obj/clang-tools-extra/unittests/clang-change-namespace/ClangChangeNamespaceTests.ChangeNamespaceTests.o
[661/1798] CXX obj/clang-tools-extra/unittests/clang-tidy/ClangTidyTests.DeclRefExprUtilsTest.o
[662/1798] CXX obj/clang/lib/AST/AST.TemplateBase.o
[663/1798] CXX obj/clang-tools-extra/clangd/unittests/ClangdTests.SymbolCollectorTests.o
[664/1798] CXX obj/clang/lib/ASTMatchers/Dynamic/Dynamic.Diagnostics.o
[665/1798] CXX obj/clang/lib/AST/ByteCode/AST.Disasm.o
[666/1798] CXX obj/clang-tools-extra/unittests/clang-move/ClangMoveTests.ClangMoveTests.o
[667/1798] CXX obj/clang/lib/AST/AST.ASTDumper.o
[668/1798] CXX obj/clang/lib/Analysis/Analysis.CFG.o
[669/1798] CXX obj/clang/lib/AST/AST.Mangle.o
[670/1798] CXX obj/clang/lib/AST/AST.DeclCXX.o
[671/1798] CXX obj/clang/lib/ASTMatchers/Dynamic/Dynamic.Marshallers.o
[672/1798] CXX obj/clang/lib/Analysis/Analysis.PostOrderCFGView.o
[673/1798] CXX obj/clang-tools-extra/include-cleaner/lib/lib.WalkAST.o
[674/1798] CXX obj/clang/lib/ASTMatchers/ASTMatchers.ASTMatchersInternal.o
[675/1798] CXX obj/clang/lib/AST/AST.StmtProfile.o
[676/1798] CXX obj/clang/lib/AST/AST.DeclPrinter.o
[677/1798] CXX obj/clang-tools-extra/modularize/modularize.Modularize.o
[678/1798] CXX obj/clang/lib/AST/ByteCode/AST.InterpBuiltin.o
[679/1798] CXX obj/clang/lib/Analysis/Analysis.ProgramPoint.o
[680/1798] CXX obj/clang/lib/Analysis/FlowSensitive/FlowSensitive.ASTOps.o
[681/1798] CXX obj/clang/lib/Analysis/Analysis.PathDiagnostic.o
[682/1798] CXX obj/clang/lib/Analysis/FlowSensitive/FlowSensitive.AdornedCFG.o
[683/1798] CXX obj/clang/lib/Analysis/FlowSensitive/FlowSensitive.Logger.o
[684/1798] CXX obj/clang/lib/Analysis/FlowSensitive/FlowSensitive.RecordOps.o
[685/1798] CXX obj/clang-tools-extra/unittests/clang-tidy/ClangTidyTests.AddConstTest.o
[686/1798] CXX obj/clang/lib/AST/AST.Decl.o
[687/1798] CXX obj/clang/lib/AST/AST.ASTImporterLookupTable.o
[688/1798] CXX obj/clang/lib/AST/AST.Stmt.o
[689/1798] CXX obj/clang/lib/Analysis/Analysis.ReachableCode.o
[690/1798] CXX obj/clang/lib/Analysis/Analysis.ThreadSafetyCommon.o
[691/1798] CXX obj/clang/lib/Analysis/Analysis.UninitializedValues.o
[692/1798] CXX obj/clang/lib/AST/AST.StmtPrinter.o
[693/1798] CXX obj/clang/lib/Analysis/Analysis.LiveVariables.o
[694/1798] CXX obj/clang/lib/Analysis/FlowSensitive/FlowSensitive.DataflowAnalysisContext.o
[695/1798] CXX obj/clang/lib/Analysis/FlowSensitive/FlowSensitive.HTMLLogger.o
[696/1798] CXX obj/clang/lib/AST/AST.MicrosoftMangle.o
[697/1798] CXX obj/clang/lib/AST/AST.JSONNodeDumper.o
[698/1798] CXX obj/clang/lib/AST/AST.Expr.o
[699/1798] CXX obj/clang/unittests/Frontend/FrontendTests.ReparseWorkingDirTest.o
[700/1798] CXX obj/clang/lib/AST/AST.ItaniumMangle.o
[701/1798] CXX obj/clang-tools-extra/clangd/unittests/ClangdTests.CodeCompleteTests.o
[702/1798] CXX obj/clang/lib/Analysis/Analysis.ThreadSafety.o
[703/1798] CXX obj/clang/unittests/Driver/ClangDriverTests.ToolChainTest.o
[704/1798] CXX obj/clang/lib/Analysis/Analysis.RetainSummaryManager.o
[705/1798] CXX obj/clang/lib/Analysis/FlowSensitive/Models/Models.ChromiumCheckModel.o
[706/1798] CXX obj/clang/lib/Analysis/FlowSensitive/FlowSensitive.SmartPointerAccessorCaching.o
[707/1798] CXX obj/clang/lib/AST/ByteCode/AST.Compiler.o
[708/1798] CXX obj/clang/lib/Analysis/FlowSensitive/FlowSensitive.DataflowEnvironment.o
[709/1798] CXX obj/clang/lib/Analysis/Analysis.ExprMutationAnalyzer.o
[710/1798] CXX obj/clang/lib/Analysis/FlowSensitive/FlowSensitive.Transfer.o
[711/1798] CXX obj/clang/lib/Analysis/FlowSensitive/FlowSensitive.TypeErasedDataflowAnalysis.o
[712/1798] CXX obj/clang/lib/AST/AST.ASTImporter.o
[713/1798] CXX obj/clang/lib/CodeGen/Targets/CodeGen.AVR.o
[714/1798] CXX obj/clang/lib/CodeGen/CodeGen.CGCUDARuntime.o
[715/1798] CXX obj/clang/lib/CodeGen/CodeGen.CGGPUBuiltin.o
[716/1798] CXX obj/clang/lib/CodeGen/CodeGen.CGCleanup.o
[717/1798] CXX obj/clang/lib/CodeGen/CodeGen.CGCoroutine.o
[718/1798] CXX obj/clang/lib/AST/AST.ParentMapContext.o
[719/1798] CXX obj/clang/lib/CodeGen/CodeGen.CGObjCRuntime.o
[720/1798] CXX obj/clang/lib/AST/AST.TextNodeDumper.o
[721/1798] CXX obj/clang/lib/CodeGen/CodeGen.CGOpenCLRuntime.o
[722/1798] CXX obj/clang/lib/CodeGen/CodeGen.CGPointerAuth.o
[723/1798] CXX obj/clang/lib/CodeGen/CodeGen.CodeGenABITypes.o
[724/1798] CXX obj/clang/lib/CodeGen/CodeGen.CGVTT.o
[725/1798] CXX obj/clang-tools-extra/unittests/clang-tidy/ClangTidyTests.OverlappingReplacementsTest.o
[726/1798] CXX obj/clang/lib/CodeGen/CodeGen.CGCXX.o
[727/1798] CXX obj/clang/lib/CodeGen/CodeGen.CGNonTrivialStruct.o
[728/1798] CXX obj/clang/lib/CodeGen/CodeGen.CGCXXABI.o
[729/1798] CXX obj/clang/lib/CodeGen/CodeGen.CGRecordLayoutBuilder.o
[730/1798] CXX obj/clang/lib/Analysis/FlowSensitive/Models/Models.UncheckedOptionalAccessModel.o
[731/1798] CXX obj/clang/lib/CodeGen/CodeGen.ABIInfo.o
[732/1798] CXX obj/clang/lib/AST/AST.ASTContext.o
[733/1798] CXX obj/clang/lib/CodeGen/CodeGen.ABIInfoImpl.o
[734/1798] CXX obj/clang/lib/CodeGen/CodeGen.CGVTables.o
[735/1798] CXX obj/clang/lib/CodeGen/CodeGen.CGObjC.o
[736/1798] CXX obj/clang/lib/CodeGen/CodeGen.LinkInModulesPass.o
[737/1798] CXX obj/clang/lib/CodeGen/CodeGen.CGAtomic.o
[738/1798] CXX obj/clang/lib/CodeGen/CodeGen.CGObjCGNU.o
[739/1798] CXX obj/clang/lib/CodeGen/CodeGen.CGExprScalar.o
[740/1798] CXX obj/clang/lib/CodeGen/CodeGen.CGDeclCXX.o
[741/1798] CXX obj/clang/lib/CodeGen/CodeGen.CGOpenMPRuntimeGPU.o
[742/1798] CXX obj/clang/lib/CodeGen/CodeGen.CGClass.o
[743/1798] CXX obj/clang/lib/CodeGen/CodeGen.CGBlocks.o
[744/1798] CXX obj/clang/lib/CodeGen/CodeGen.CGObjCMac.o
[745/1798] CXX obj/clang/lib/CodeGen/CodeGen.CGExprComplex.o
[746/1798] CXX obj/clang/lib/CodeGen/CodeGen.CGException.o
[747/1798] CXX obj/clang/lib/CodeGen/CodeGen.CGStmt.o
[748/1798] CXX obj/clang/lib/CodeGen/CodeGen.CGExprAgg.o
[749/1798] CXX obj/clang/lib/CodeGen/CodeGen.CodeGenTypes.o
[750/1798] CXX obj/clang/lib/CodeGen/CodeGen.CGDecl.o
[751/1798] CXX obj/clang/lib/CodeGen/CodeGen.CGExprCXX.o
[752/1798] CXX obj/clang/lib/CodeGen/CodeGen.CodeGenTBAA.o
[753/1798] CXX obj/clang/lib/CodeGen/CodeGen.TargetInfo.o
[754/1798] CXX obj/clang/lib/CodeGen/Targets/CodeGen.ARC.o
[755/1798] CXX obj/clang/lib/CodeGen/CodeGen.CGExprConstant.o
[756/1798] CXX obj/clang/lib/ExtractAPI/ExtractAPI.API.o
[757/1798] CXX obj/clang/lib/ASTMatchers/ASTMatchers.ASTMatchFinder.o
[758/1798] CXX obj/clang/lib/Analysis/Analysis.UnsafeBufferUsage.o
[759/1798] CXX obj/clang/lib/AST/AST.DynamicRecursiveASTVisitor.o
[760/1798] CXX obj/clang/lib/CodeGen/CodeGen.CodeGenFunction.o
[761/1798] CXX obj/clang/lib/CodeGen/Targets/CodeGen.AMDGPU.o
[762/1798] CXX obj/clang/lib/CodeGen/Targets/CodeGen.AArch64.o
[763/1798] CXX obj/clang/lib/CodeGen/Targets/CodeGen.BPF.o
[764/1798] CXX obj/clang/lib/Edit/Edit.RewriteObjCFoundationAPI.o
[765/1798] CXX obj/clang/lib/CodeGen/Targets/CodeGen.CSKY.o
[766/1798] CXX obj/clang/lib/CodeGen/CodeGen.CGHLSLRuntime.o
[767/1798] CXX obj/clang/lib/CodeGen/Targets/CodeGen.ARM.o
[768/1798] CXX obj/clang/lib/CodeGen/Targets/CodeGen.Hexagon.o
[769/1798] CXX obj/clang/lib/CodeGen/CodeGen.CGCall.o
[770/1798] CXX obj/clang/lib/CodeGen/Targets/CodeGen.DirectX.o
[771/1798] CXX obj/clang/lib/CodeGen/CodeGen.ItaniumCXXABI.o
[772/1798] CXX obj/clang/lib/ExtractAPI/ExtractAPI.TypedefUnderlyingTypeResolver.o
[773/1798] CXX obj/clang/lib/CodeGen/Targets/CodeGen.Lanai.o
[774/1798] CXX obj/clang/lib/CodeGen/Targets/CodeGen.M68k.o
[775/1798] CXX obj/clang/lib/CodeGen/CodeGen.CGExpr.o
[776/1798] CXX obj/clang/lib/CodeGen/CodeGen.MicrosoftCXXABI.o
[777/1798] CXX obj/clang/lib/CodeGen/Targets/CodeGen.MSP430.o
[778/1798] CXX obj/clang/lib/CodeGen/Targets/CodeGen.LoongArch.o
[779/1798] CXX obj/clang/lib/ExtractAPI/ExtractAPI.DeclarationFragments.o
[780/1798] CXX obj/clang/lib/CodeGen/CodeGen.CodeGenAction.o
[781/1798] CXX obj/clang/lib/CodeGen/CodeGen.CoverageMappingGen.o
[782/1798] CXX obj/clang/lib/CodeGen/Targets/CodeGen.PNaCl.o
[783/1798] CXX obj/clang/lib/Frontend/Frontend.ModuleDependencyCollector.o
[784/1798] CXX obj/clang/lib/AST/AST.ExprConstant.o
[785/1798] CXX obj/clang/lib/CodeGen/Targets/CodeGen.Mips.o
[786/1798] CXX obj/clang/lib/CodeGen/Targets/CodeGen.NVPTX.o
[787/1798] CXX obj/clang/lib/CodeGen/Targets/CodeGen.Sparc.o
[788/1798] CXX obj/clang/lib/CodeGen/Targets/CodeGen.SystemZ.o
[789/1798] CXX obj/clang/lib/CodeGen/Targets/CodeGen.SPIR.o
[790/1798] CXX obj/clang/lib/CodeGen/Targets/CodeGen.TCE.o
[791/1798] CXX obj/clang/lib/CodeGen/Targets/CodeGen.VE.o
[792/1798] CXX obj/clang/lib/CodeGen/Targets/CodeGen.PPC.o
[793/1798] CXX obj/clang/lib/CodeGen/Targets/CodeGen.RISCV.o
[794/1798] CXX obj/clang/lib/CrossTU/CrossTU.CrossTranslationUnit.o
[795/1798] CXX obj/clang/lib/CodeGen/CodeGen.BackendUtil.o
[796/1798] CXX obj/clang/lib/CodeGen/CodeGen.CGStmtOpenMP.o
[797/1798] CXX obj/clang/lib/CodeGen/Targets/CodeGen.WebAssembly.o
[798/1798] CXX obj/clang/lib/ExtractAPI/Serialization/ExtractAPI.SymbolGraphSerializer.o
[799/1798] CXX obj/clang/lib/Frontend/Frontend.InitPreprocessor.o
[800/1798] CXX obj/clang/lib/Frontend/Frontend.PrecompiledPreamble.o
[801/1798] CXX obj/clang/lib/Frontend/Frontend.ChainedIncludesSource.o
[802/1798] CXX obj/clang/lib/CodeGen/Targets/CodeGen.XCore.o
[803/1798] CXX obj/clang/lib/Frontend/Frontend.ASTMerge.o
[804/1798] CXX obj/clang/lib/Frontend/Frontend.CreateInvocationFromCommandLine.o
[805/1798] CXX obj/clang/lib/Frontend/Frontend.DependencyFile.o
[806/1798] CXX obj/clang/lib/CodeGen/Targets/CodeGen.X86.o
[807/1798] CXX obj/clang/lib/Frontend/Frontend.TestModuleFileExtension.o
[808/1798] CXX obj/clang/lib/FrontendTool/FrontendTool.ExecuteCompilerInvocation.o
[809/1798] CXX obj/clang/lib/Sema/Sema.HeuristicResolver.o
[810/1798] CXX obj/clang/lib/Frontend/Frontend.CompilerInstance.o
[811/1798] CXX obj/clang/lib/CodeGen/CodeGen.CGOpenMPRuntime.o
[812/1798] CXX obj/clang/lib/Interpreter/Interpreter.DeviceOffload.o
[813/1798] CXX obj/clang/lib/CodeGen/CodeGen.CodeGenPGO.o
[814/1798] CXX obj/clang/lib/Sema/Sema.ScopeInfo.o
[815/1798] CXX obj/clang/lib/Index/Index.IndexingAction.o
[816/1798] CXX obj/clang/lib/Sema/Sema.DelayedDiagnostic.o
[817/1798] CXX obj/clang/lib/CodeGen/CodeGen.ObjectFilePCHContainerWriter.o
[818/1798] CXX obj/clang/lib/Frontend/Rewrite/Rewrite.FrontendActions.o
[819/1798] CXX obj/clang/lib/InstallAPI/InstallAPI.Frontend.o
[820/1798] CXX obj/clang/lib/Parse/Parse.ParseHLSL.o
[821/1798] CXX obj/clang/lib/Parse/Parse.ParseAST.o
[822/1798] CXX obj/clang/lib/Interpreter/Interpreter.InterpreterUtils.o
[823/1798] CXX obj/clang/unittests/CodeGen/ClangCodeGenTests.TBAAMetadataTest.o
[824/1798] CXX obj/clang/lib/Sema/Sema.MultiplexExternalSemaSource.o
[825/1798] CXX obj/clang/lib/Frontend/Frontend.FrontendAction.o
[826/1798] CXX obj/clang/lib/Parse/Parse.ParseCXXInlineMethods.o
[827/1798] CXX obj/clang/lib/Sema/Sema.DeclSpec.o
[828/1798] CXX obj/clang/lib/Sema/Sema.HLSLExternalSemaSource.o
[829/1798] CXX obj/clang/lib/Parse/Parse.ParseInit.o
[830/1798] CXX obj/clang/lib/Interpreter/Interpreter.CodeCompletion.o
[831/1798] CXX obj/clang/lib/Interpreter/Interpreter.IncrementalParser.o
[832/1798] CXX obj/clang/lib/Interpreter/Interpreter.InterpreterValuePrinter.o
[833/1798] CXX obj/clang/lib/Parse/Parse.ParseTentative.o
[834/1798] CXX obj/clang/lib/Frontend/Frontend.ASTUnit.o
[835/1798] CXX obj/clang/lib/Frontend/Rewrite/Rewrite.RewriteObjC.o
[836/1798] CXX obj/clang/lib/Sema/Sema.CodeCompleteConsumer.o
[837/1798] CXX obj/clang/lib/Parse/Parse.ParseExprCXX.o
[838/1798] CXX obj/clang/lib/Sema/Sema.JumpDiagnostics.o
[839/1798] CXX obj/clang/lib/Sema/Sema.SemaAMDGPU.o
[840/1798] CXX obj/clang/lib/Sema/Sema.SemaAVR.o
[841/1798] CXX obj/clang/lib/Sema/Sema.CheckExprLifetime.o
[842/1798] CXX obj/clang/lib/Parse/Parse.ParseTemplate.o
[843/1798] CXX obj/clang/lib/Parse/Parse.ParseExpr.o
[844/1798] CXX obj/clang/lib/Frontend/Frontend.FrontendActions.o
[845/1798] CXX obj/clang/lib/Parse/Parse.ParseStmt.o
[846/1798] CXX obj/clang/lib/Parse/Parse.Parser.o
[847/1798] CXX obj/clang/lib/Parse/Parse.ParseStmtAsm.o
[848/1798] CXX obj/clang/lib/Parse/Parse.ParseOpenACC.o
[849/1798] CXX obj/clang/lib/Index/Index.IndexTypeSourceInfo.o
[850/1798] CXX obj/clang/lib/Parse/Parse.ParseDeclCXX.o
[851/1798] CXX obj/clang/lib/Sema/Sema.SemaAccess.o
[852/1798] CXX obj/clang/lib/Parse/Parse.ParseObjc.o
[853/1798] CXX obj/clang/lib/Frontend/Rewrite/Rewrite.RewriteModernObjC.o
[854/1798] CXX obj/clang/lib/Parse/Parse.ParsePragma.o
[855/1798] CXX obj/clang/lib/CodeGen/CodeGen.CGDebugInfo.o
[856/1798] CXX obj/clang/lib/Frontend/Frontend.InterfaceStubFunctionsConsumer.o
[857/1798] CXX obj/clang/lib/AST/ByteCode/AST.Interp.o
[858/1798] AR lib/libclangAST.a
[859/1798] AR lib/libclangIncludeCleaner.a
[860/1798] AR lib/libclangASTMatchers.a
[861/1798] AR lib/libclangDynamicASTMatchers.a
[862/1798] AR lib/libclangAnalysis.a
[863/1798] AR lib/libclangAnalysisFlowSensitive.a
[864/1798] AR lib/libclangAnalysisFlowSensitiveModels.a
[865/1798] AR lib/libclangEdit.a
[866/1798] CXX obj/clang/lib/Parse/Parse.ParseOpenMP.o
[867/1798] CXX obj/clang/lib/StaticAnalyzer/Checkers/Checkers.NoOwnershipChangeVisitor.o
[868/1798] CXX obj/clang/lib/StaticAnalyzer/Checkers/Checkers.AssumeModeling.o
[869/1798] CXX obj/clang/lib/StaticAnalyzer/Checkers/Checkers.CheckObjCInstMethSignature.o
[870/1798] CXX obj/clang/lib/Sema/Sema.SemaAPINotes.o
[871/1798] CXX obj/clang/lib/Index/Index.IndexBody.o
[872/1798] CXX obj/clang/lib/StaticAnalyzer/Checkers/Checkers.BlockInCriticalSectionChecker.o
[873/1798] CXX obj/clang/lib/StaticAnalyzer/Checkers/Checkers.AnalyzerStatsChecker.o
[874/1798] CXX obj/clang/lib/Frontend/Frontend.ASTConsumers.o
[875/1798] CXX obj/clang/lib/StaticAnalyzer/Checkers/Checkers.ChrootChecker.o
[876/1798] CXX obj/clang/lib/StaticAnalyzer/Checkers/Checkers.CheckerDocumentation.o
[877/1798] CXX obj/clang/lib/Sema/Sema.SemaAttr.o
[878/1798] CXX obj/clang/lib/Parse/Parse.ParseDecl.o
[879/1798] CXX obj/clang/lib/Sema/Sema.AnalysisBasedWarnings.o
[880/1798] CXX obj/clang/lib/StaticAnalyzer/Checkers/Checkers.CheckPlacementNew.o
[881/1798] CXX obj/clang/lib/StaticAnalyzer/Checkers/Checkers.ConversionChecker.o
[882/1798] CXX obj/clang/lib/Interpreter/Interpreter.Interpreter.o
[883/1798] CXX obj/clang/lib/Sema/Sema.SemaAvailability.o
[884/1798] CXX obj/clang/lib/Sema/Sema.SemaBase.o
[885/1798] CXX obj/clang/lib/Sema/Sema.SemaBPF.o
[886/1798] CXX obj/clang/lib/StaticAnalyzer/Checkers/Checkers.DebugContainerModeling.o
[887/1798] CXX obj/clang/lib/StaticAnalyzer/Checkers/Checkers.DebugIteratorModeling.o
[888/1798] CXX obj/clang/lib/Sema/Sema.SemaBoundsSafety.o
[889/1798] CXX obj/clang/lib/StaticAnalyzer/Checkers/Checkers.CheckObjCDealloc.o
[890/1798] CXX obj/clang/lib/StaticAnalyzer/Checkers/Checkers.DivZeroChecker.o
[891/1798] CXX obj/clang/lib/StaticAnalyzer/Checkers/Checkers.DeadStoresChecker.o
[892/1798] CXX obj/clang/lib/StaticAnalyzer/Checkers/Checkers.CheckSecuritySyntaxOnly.o
[893/1798] CXX obj/clang/lib/StaticAnalyzer/Checkers/Checkers.DereferenceChecker.o
[894/1798] CXX obj/clang/lib/StaticAnalyzer/Checkers/Checkers.CloneChecker.o
[895/1798] CXX obj/clang/lib/StaticAnalyzer/Checkers/Checkers.DynamicTypeChecker.o
[896/1798] CXX obj/lldb/source/Plugins/SymbolFile/DWARF/DWARF.DWARFASTParserClang.o
[897/1798] CXX obj/clang/lib/StaticAnalyzer/Checkers/Checkers.DirectIvarAssignment.o
[898/1798] CXX obj/clang/lib/StaticAnalyzer/Checkers/Checkers.EnumCastOutOfRangeChecker.o
[899/1798] CXX obj/clang/lib/Sema/Sema.ParsedAttr.o
[900/1798] CXX obj/clang/lib/StaticAnalyzer/Checkers/Checkers.BuiltinFunctionChecker.o
[901/1798] CXX obj/clang/lib/Sema/Sema.SemaARM.o
[902/1798] CXX obj/clang/lib/StaticAnalyzer/Checkers/Checkers.NSErrorChecker.o
[903/1798] CXX obj/clang/lib/StaticAnalyzer/Checkers/Checkers.ContainerModeling.o
[904/1798] CXX obj/clang/lib/Sema/Sema.SemaCXXScopeSpec.o
[905/1798] CXX obj/clang/lib/InstallAPI/InstallAPI.Visitor.o
[906/1798] AR lib/libclangInstallAPI.a
[907/1798] CXX obj/clang/lib/StaticAnalyzer/Checkers/Checkers.DynamicTypePropagation.o
[908/1798] CXX obj/clang/lib/Sema/Sema.SemaHexagon.o
[909/1798] CXX obj/clang/lib/Sema/Sema.SemaExceptionSpec.o
[910/1798] CXX obj/clang/lib/StaticAnalyzer/Checkers/Checkers.DebugCheckers.o
[911/1798] CXX obj/clang/lib/Sema/Sema.SemaOpenACCAtomic.o
[912/1798] CXX obj/clang/lib/Sema/Sema.SemaCUDA.o
[913/1798] CXX obj/clang/lib/Sema/Sema.SemaFixItUtils.o
[914/1798] CXX obj/clang/lib/Sema/Sema.SemaLoongArch.o
[915/1798] CXX obj/clang/lib/CodeGen/CodeGen.CodeGenModule.o
[916/1798] CXX obj/clang/lib/Sema/Sema.SemaCoroutine.o
[917/1798] CXX obj/clang/lib/Sema/Sema.SemaCast.o
[918/1798] CXX obj/clang/lib/Sema/Sema.Sema.o
[919/1798] CXX obj/clang/lib/StaticAnalyzer/Checkers/Checkers.CStringChecker.o
[920/1798] CXX obj/clang/lib/Sema/Sema.SemaNVPTX.o
[921/1798] CXX obj/clang/lib/Sema/Sema.SemaMIPS.o
[922/1798] CXX obj/clang/lib/Sema/Sema.SemaFunctionEffects.o
[923/1798] CXX obj/clang/lib/Sema/Sema.SemaOpenACCClause.o
[924/1798] CXX obj/clang/lib/Sema/Sema.SemaExprMember.o
[925/1798] CXX obj/clang/lib/Sema/Sema.SemaPPC.o
[926/1798] CXX obj/clang/lib/Sema/Sema.SemaOpenCL.o
[927/1798] CXX obj/clang/lib/Sema/Sema.SemaSystemZ.o
[928/1798] CXX obj/clang/lib/Sema/Sema.SemaSPIRV.o
[929/1798] CXX obj/clang/lib/Sema/Sema.SemaSwift.o
[930/1798] CXX obj/clang/lib/Sema/Sema.SemaX86.o
[931/1798] CXX obj/clang/lib/Sema/Sema.SemaOpenACC.o
[932/1798] CXX obj/clang/lib/Sema/Sema.SemaModule.o
[933/1798] CXX obj/clang/lib/Sema/Sema.SemaHLSL.o
[934/1798] CXX obj/clang/lib/Sema/Sema.SemaWasm.o
[935/1798] CXX obj/clang/lib/Sema/Sema.SemaRISCV.o
[936/1798] CXX obj/clang/lib/Sema/Sema.SemaLambda.o
[937/1798] CXX obj/clang/lib/Sema/Sema.SemaDeclObjC.o
[938/1798] CXX obj/clang/lib/Sema/Sema.SemaPseudoObject.o
[939/1798] CXX obj/clang/lib/Sema/Sema.SemaTemplateVariadic.o
[940/1798] CXX obj/clang/lib/Sema/Sema.SemaStmtAttr.o
[941/1798] CXX obj/clang/lib/StaticAnalyzer/Checkers/Checkers.CXXDeleteChecker.o
[942/1798] CXX obj/clang/lib/StaticAnalyzer/Checkers/Checkers.CXXSelfAssignmentChecker.o
[943/1798] CXX obj/clang/lib/Sema/Sema.SemaObjCProperty.o
[944/1798] CXX obj/clang/lib/Sema/Sema.SemaExprObjC.o
[945/1798] CXX obj/clang/lib/StaticAnalyzer/Checkers/Checkers.ArrayBoundChecker.o
[946/1798] CXX obj/clang/lib/StaticAnalyzer/Checkers/Checkers.CallAndMessageChecker.o
[947/1798] CXX obj/clang/lib/Sema/Sema.SemaStmtAsm.o
[948/1798] CXX obj/clang/lib/Sema/Sema.SemaObjC.o
[949/1798] CXX obj/clang/lib/StaticAnalyzer/Checkers/Checkers.CStringSyntaxChecker.o
[950/1798] CXX obj/clang/lib/StaticAnalyzer/Checkers/Checkers.CastSizeChecker.o
[951/1798] CXX obj/clang/lib/StaticAnalyzer/Core/Core.SVals.o
[952/1798] CXX obj/clang/lib/Serialization/Serialization.GeneratePCH.o
[953/1798] CXX obj/clang/lib/Sema/Sema.SemaInit.o
[954/1798] CXX obj/clang/lib/StaticAnalyzer/Checkers/Checkers.CastToStructChecker.o
[955/1798] CXX obj/clang/lib/StaticAnalyzer/Checkers/Checkers.AnalysisOrderChecker.o
[956/1798] CXX obj/clang/lib/StaticAnalyzer/Checkers/Checkers.CastValueChecker.o
[957/1798] CXX obj/clang/lib/StaticAnalyzer/Checkers/Checkers.BitwiseShiftChecker.o
[958/1798] CXX obj/clang/lib/Tooling/Tooling.StandaloneExecution.o
[959/1798] CXX obj/clang/lib/StaticAnalyzer/Core/Core.SymbolManager.o
[960/1798] CXX obj/clang/lib/Sema/Sema.SemaCodeComplete.o
[961/1798] CXX obj/clang/lib/StaticAnalyzer/Checkers/Checkers.BoolAssignmentChecker.o
[962/1798] CXX obj/clang/lib/Tooling/Tooling.Execution.o
[963/1798] CXX obj/clang/lib/Sema/Sema.SemaDeclAttr.o
[964/1798] CXX obj/clang/lib/StaticAnalyzer/Core/Core.WorkList.o
[965/1798] CXX obj/clang/lib/StaticAnalyzer/Core/Core.SimpleConstraintManager.o
[966/1798] CXX obj/clang/lib/ExtractAPI/ExtractAPI.ExtractAPIConsumer.o
[967/1798] CXX obj/clang/lib/StaticAnalyzer/Core/Core.SarifDiagnostics.o
[968/1798] CXX obj/clang/lib/StaticAnalyzer/Checkers/Checkers.BasicObjCFoundationChecks.o
[969/1798] CXX obj/clang/lib/StaticAnalyzer/Core/Core.Store.o
[970/1798] CXX obj/clang/lib/Sema/Sema.SemaChecking.o
[971/1798] CXX obj/clang/lib/Tooling/Tooling.Tooling.o
[972/1798] CXX obj/clang/lib/Serialization/Serialization.ASTWriterDecl.o
[973/1798] CXX obj/clang/lib/StaticAnalyzer/Core/Core.SimpleSValBuilder.o
[974/1798] CXX obj/clang/lib/StaticAnalyzer/Core/Core.TextDiagnostics.o
[975/1798] CXX obj/clang/lib/Tooling/Tooling.ExpandResponseFilesCompilationDatabase.o
[976/1798] CXX obj/clang/lib/StaticAnalyzer/Checkers/Checkers.Iterator.o
[977/1798] CXX obj/clang/lib/StaticAnalyzer/Core/Core.Z3CrosscheckVisitor.o
[978/1798] CXX obj/clang/lib/Sema/Sema.SemaLookup.o
[979/1798] CXX obj/clang/lib/StaticAnalyzer/Checkers/Checkers.FixedAddressChecker.o
[980/1798] CXX obj/clang/lib/Tooling/Tooling.CommonOptionsParser.o
[981/1798] CXX obj/clang/lib/StaticAnalyzer/Checkers/Checkers.ErrnoTesterChecker.o
[982/1798] CXX obj/clang/lib/Serialization/Serialization.ASTWriterStmt.o
[983/1798] CXX obj/clang/lib/Sema/Sema.SemaStmt.o
[984/1798] CXX obj/clang/lib/Tooling/Tooling.RefactoringCallbacks.o
[985/1798] CXX obj/clang/lib/StaticAnalyzer/Checkers/Checkers.ErrnoChecker.o
[986/1798] CXX obj/clang/lib/StaticAnalyzer/Checkers/Checkers.GTestChecker.o
[987/1798] CXX obj/clang/lib/StaticAnalyzer/Checkers/Checkers.ErrnoModeling.o
[988/1798] CXX obj/clang/lib/StaticAnalyzer/Checkers/Checkers.InvalidatedIteratorChecker.o
[989/1798] CXX obj/clang/lib/Serialization/Serialization.ASTReaderStmt.o
[990/1798] CXX obj/clang/lib/StaticAnalyzer/Checkers/Checkers.InnerPointerChecker.o
[991/1798] CXX obj/clang/lib/StaticAnalyzer/Checkers/Checkers.IteratorRangeChecker.o
[992/1798] CXX obj/clang/lib/StaticAnalyzer/Checkers/Checkers.FuchsiaHandleChecker.o
[993/1798] CXX obj/clang/lib/StaticAnalyzer/Checkers/Checkers.ExprInspectionChecker.o
[994/1798] CXX obj/clang/lib/StaticAnalyzer/Frontend/Frontend.AnalysisConsumer.o
[995/1798] CXX obj/clang/lib/Sema/Sema.SemaType.o
[996/1798] CXX obj/clang/lib/StaticAnalyzer/Checkers/MPI-Checker/Checkers.MPIBugReporter.o
[997/1798] CXX obj/clang/lib/StaticAnalyzer/Checkers/Checkers.IteratorModeling.o
[998/1798] CXX obj/clang/lib/Sema/Sema.SemaOverload.o
[999/1798] CXX obj/clang/lib/StaticAnalyzer/Checkers/MPI-Checker/Checkers.MPIFunctionClassifier.o
[1000/1798] CXX obj/clang/lib/StaticAnalyzer/Checkers/Checkers.LLVMConventionsChecker.o
[1001/1798] CXX obj/clang/lib/StaticAnalyzer/Checkers/Checkers.MIGChecker.o
[1002/1798] CXX obj/clang/lib/StaticAnalyzer/Checkers/Checkers.MismatchedIteratorChecker.o
[1003/1798] CXX obj/clang/lib/StaticAnalyzer/Checkers/MPI-Checker/Checkers.MPIChecker.o
[1004/1798] CXX obj/clang/lib/StaticAnalyzer/Checkers/Checkers.MacOSXAPIChecker.o
[1005/1798] CXX obj/clang/lib/StaticAnalyzer/Checkers/Checkers.NSAutoreleasePoolChecker.o
[1006/1798] CXX obj/clang/lib/StaticAnalyzer/Checkers/Checkers.MmapWriteExecChecker.o
[1007/1798] CXX obj/clang/lib/StaticAnalyzer/Checkers/Checkers.IvarInvalidationChecker.o
[1008/1798] CXX obj/clang/lib/Sema/Sema.SemaDeclCXX.o
[1009/1798] CXX obj/clang/lib/StaticAnalyzer/Checkers/Checkers.GCDAntipatternChecker.o
[1010/1798] CXX obj/clang/lib/StaticAnalyzer/Checkers/Checkers.MallocSizeofChecker.o
[1011/1798] CXX obj/clang/lib/StaticAnalyzer/Checkers/Checkers.MacOSKeychainAPIChecker.o
[1012/1798] CXX obj/clang/lib/Sema/Sema.SemaConcept.o
[1013/1798] CXX obj/clang/lib/StaticAnalyzer/Checkers/Checkers.NoReturnFunctionChecker.o
[1014/1798] CXX obj/clang/lib/StaticAnalyzer/Checkers/Checkers.MoveChecker.o
[1015/1798] CXX obj/clang/lib/StaticAnalyzer/Checkers/Checkers.NonNullParamChecker.o
[1016/1798] CXX obj/clang/lib/StaticAnalyzer/Checkers/Checkers.LocalizationChecker.o
[1017/1798] CXX obj/clang/lib/StaticAnalyzer/Checkers/Checkers.ObjCAtSyncChecker.o
[1018/1798] CXX obj/clang/lib/Serialization/Serialization.ASTReaderDecl.o
[1019/1798] CXX obj/clang/lib/StaticAnalyzer/Checkers/Checkers.NonnullGlobalConstantsChecker.o
[1020/1798] CXX obj/clang/lib/StaticAnalyzer/Checkers/Checkers.ObjCPropertyChecker.o
[1021/1798] CXX obj/clang/lib/StaticAnalyzer/Checkers/Checkers.ObjCMissingSuperCallChecker.o
[1022/1798] CXX obj/clang/lib/StaticAnalyzer/Checkers/Checkers.ObjCContainersASTChecker.o
[1023/1798] CXX obj/clang/lib/StaticAnalyzer/Checkers/Checkers.ObjCContainersChecker.o
[1024/1798] CXX obj/clang/lib/StaticAnalyzer/Checkers/Checkers.ObjCUnusedIVarsChecker.o
[1025/1798] CXX obj/clang/lib/StaticAnalyzer/Checkers/Checkers.GenericTaintChecker.o
[1026/1798] CXX obj/clang/lib/StaticAnalyzer/Checkers/Checkers.PutenvStackArrayChecker.o
[1027/1798] CXX obj/clang/lib/StaticAnalyzer/Checkers/Checkers.ObjCSelfInitChecker.o
[1028/1798] CXX obj/clang/lib/StaticAnalyzer/Checkers/Checkers.NullabilityChecker.o
[1029/1798] CXX obj/clang/lib/StaticAnalyzer/Checkers/Checkers.ObjCSuperDeallocChecker.o
[1030/1798] CXX obj/clang/lib/Sema/Sema.SemaSYCL.o
[1031/1798] CXX obj/clang/lib/StaticAnalyzer/Checkers/Checkers.PointerSubChecker.o
[1032/1798] CXX obj/clang/lib/StaticAnalyzer/Checkers/Checkers.PaddingChecker.o
[1033/1798] CXX obj/clang/lib/StaticAnalyzer/Checkers/Checkers.PointerArithChecker.o
[1034/1798] CXX obj/clang/lib/Sema/Sema.SemaDecl.o
[1035/1798] CXX obj/clang/lib/StaticAnalyzer/Checkers/Checkers.ReturnPointerRangeChecker.o
[1036/1798] CXX obj/clang/lib/StaticAnalyzer/Checkers/Checkers.PthreadLockChecker.o
[1037/1798] CXX obj/clang/lib/StaticAnalyzer/Checkers/RetainCountChecker/Checkers.RetainCountDiagnostics.o
[1038/1798] CXX obj/clang/lib/StaticAnalyzer/Checkers/Checkers.ReturnUndefChecker.o
[1039/1798] CXX obj/clang/lib/StaticAnalyzer/Checkers/Checkers.OSObjectCStyleCast.o
[1040/1798] CXX obj/clang/lib/StaticAnalyzer/Checkers/Checkers.ReturnValueChecker.o
[1041/1798] CXX obj/clang/lib/StaticAnalyzer/Checkers/Checkers.STLAlgorithmModeling.o
[1042/1798] CXX obj/clang/lib/StaticAnalyzer/Checkers/RetainCountChecker/Checkers.RetainCountChecker.o
[1043/1798] CXX obj/clang/lib/StaticAnalyzer/Checkers/Checkers.SetgidSetuidOrderChecker.o
[1044/1798] CXX obj/clang/lib/StaticAnalyzer/Checkers/Checkers.SmartPtrChecker.o
[1045/1798] CXX obj/clang/lib/Sema/Sema.SemaTemplateDeductionGuide.o
[1046/1798] CXX obj/clang/lib/StaticAnalyzer/Checkers/Checkers.StackAddrEscapeChecker.o
[1047/1798] CXX obj/clang/lib/StaticAnalyzer/Checkers/Checkers.SimpleStreamChecker.o
[1048/1798] CXX obj/clang/lib/StaticAnalyzer/Checkers/Checkers.TaintTesterChecker.o
[1049/1798] CXX obj/clang/lib/StaticAnalyzer/Checkers/Checkers.StringChecker.o
[1050/1798] CXX obj/clang/lib/StaticAnalyzer/Checkers/Checkers.StdVariantChecker.o
[1051/1798] CXX obj/clang/lib/StaticAnalyzer/Checkers/Checkers.TraversalChecker.o
[1052/1798] CXX obj/clang/lib/StaticAnalyzer/Checkers/Checkers.SmartPtrModeling.o
[1053/1798] CXX obj/clang/lib/StaticAnalyzer/Checkers/Checkers.ObjCAutoreleaseWriteChecker.o
[1054/1798] CXX obj/clang/lib/StaticAnalyzer/Checkers/Checkers.TrustReturnsNonnullChecker.o
[1055/1798] CXX obj/clang/lib/StaticAnalyzer/Checkers/Checkers.UndefResultChecker.o
[1056/1798] CXX obj/clang/lib/StaticAnalyzer/Checkers/Checkers.UndefBranchChecker.o
[1057/1798] CXX obj/clang/lib/StaticAnalyzer/Checkers/Checkers.TestAfterDivZeroChecker.o
[1058/1798] CXX obj/clang/lib/StaticAnalyzer/Checkers/Checkers.UndefCapturedBlockVarChecker.o
[1059/1798] CXX obj/clang/lib/StaticAnalyzer/Checkers/Checkers.UndefinedArraySubscriptChecker.o
[1060/1798] CXX obj/clang/lib/StaticAnalyzer/Checkers/Checkers.UndefinedAssignmentChecker.o
[1061/1798] CXX obj/clang/lib/StaticAnalyzer/Checkers/Checkers.Taint.o
[1062/1798] CXX obj/clang/lib/StaticAnalyzer/Checkers/Checkers.NumberObjectConversionChecker.o
[1063/1798] CXX obj/clang/lib/StaticAnalyzer/Checkers/WebKit/Checkers.ASTUtils.o
[1064/1798] CXX obj/clang/lib/StaticAnalyzer/Checkers/Checkers.UndefinedNewArraySizeChecker.o
[1065/1798] CXX obj/clang/lib/StaticAnalyzer/Checkers/Checkers.TrustNonnullChecker.o
[1066/1798] CXX obj/clang/lib/StaticAnalyzer/Checkers/UninitializedObject/Checkers.UninitializedPointee.o
[1067/1798] CXX obj/clang/lib/StaticAnalyzer/Checkers/Checkers.MallocChecker.o
[1068/1798] CXX obj/clang/lib/StaticAnalyzer/Checkers/Checkers.RunLoopAutoreleaseLeakChecker.o
[1069/1798] CXX obj/clang/lib/StaticAnalyzer/Checkers/Checkers.UnreachableCodeChecker.o
[1070/1798] CXX obj/clang/lib/StaticAnalyzer/Checkers/Checkers.UnixAPIChecker.o
[1071/1798] CXX obj/clang/lib/StaticAnalyzer/Checkers/WebKit/Checkers.PtrTypesSemantics.o
[1072/1798] CXX obj/clang/lib/Sema/Sema.SemaTemplateDeduction.o
[1073/1798] CXX obj/clang/lib/StaticAnalyzer/Checkers/Checkers.VforkChecker.o
[1074/1798] CXX obj/clang/lib/StaticAnalyzer/Frontend/Frontend.CreateCheckerManager.o
[1075/1798] CXX obj/clang/lib/StaticAnalyzer/Checkers/Checkers.VirtualCallChecker.o
[1076/1798] CXX obj/clang/lib/StaticAnalyzer/Frontend/Frontend.CheckerRegistry.o
[1077/1798] CXX obj/clang/lib/StaticAnalyzer/Checkers/Checkers.ValistChecker.o
[1078/1798] CXX obj/clang/lib/StaticAnalyzer/Checkers/Checkers.VLASizeChecker.o
[1079/1798] CXX obj/clang/lib/StaticAnalyzer/Checkers/WebKit/Checkers.RawPtrRefLocalVarsChecker.o
[1080/1798] CXX obj/clang/lib/StaticAnalyzer/Checkers/WebKit/Checkers.RawPtrRefCallArgsChecker.o
[1081/1798] CXX obj/clang/lib/Sema/Sema.SemaTemplateInstantiateDecl.o
[1082/1798] CXX obj/clang/lib/StaticAnalyzer/Checkers/WebKit/Checkers.RawPtrRefLambdaCapturesChecker.o
[1083/1798] CXX obj/clang/lib/StaticAnalyzer/Core/Core.RangedConstraintManager.o
[1084/1798] CXX obj/clang/lib/StaticAnalyzer/Checkers/WebKit/Checkers.RawPtrRefMemberChecker.o
[1085/1798] CXX obj/clang/lib/StaticAnalyzer/Frontend/Frontend.FrontendActions.o
[1086/1798] CXX obj/clang/lib/StaticAnalyzer/Core/Core.ExprEngineObjC.o
[1087/1798] CXX obj/clang/lib/StaticAnalyzer/Core/Core.BasicValueFactory.o
[1088/1798] CXX obj/clang/lib/StaticAnalyzer/Checkers/WebKit/Checkers.RefCntblBaseVirtualDtorChecker.o
[1089/1798] CXX obj/clang/lib/StaticAnalyzer/Checkers/cert/Checkers.InvalidPtrChecker.o
[1090/1798] CXX obj/clang/lib/StaticAnalyzer/Core/Core.ExprEngineCallAndReturn.o
[1091/1798] CXX obj/clang/lib/StaticAnalyzer/Core/Core.AnalyzerOptions.o
[1092/1798] CXX obj/clang/lib/StaticAnalyzer/Core/Core.PlistDiagnostics.o
[1093/1798] CXX obj/clang/lib/StaticAnalyzer/Core/Core.Checker.o
[1094/1798] CXX obj/clang/lib/StaticAnalyzer/Core/Core.MemRegion.o
[1095/1798] CXX obj/clang/lib/StaticAnalyzer/Core/Core.ExplodedGraph.o
[1096/1798] CXX obj/clang/lib/StaticAnalyzer/Core/Core.CheckerRegistryData.o
[1097/1798] CXX obj/clang/lib/StaticAnalyzer/Core/Core.ConstraintManager.o
[1098/1798] CXX obj/clang/lib/StaticAnalyzer/Checkers/UninitializedObject/Checkers.UninitializedObjectChecker.o
[1099/1798] CXX obj/clang/lib/StaticAnalyzer/Checkers/Checkers.StreamChecker.o
[1100/1798] CXX obj/clang/lib/StaticAnalyzer/Core/Core.SMTConstraintManager.o
[1101/1798] CXX obj/clang/lib/StaticAnalyzer/Core/Core.AnalysisManager.o
[1102/1798] CXX obj/clang/lib/StaticAnalyzer/Core/Core.DynamicExtent.o
[1103/1798] CXX obj/clang/lib/StaticAnalyzer/Core/Core.LoopWidening.o
[1104/1798] CXX obj/clang/lib/StaticAnalyzer/Core/Core.ExprEngineC.o
[1105/1798] CXX obj/clang/lib/StaticAnalyzer/Core/Core.ExprEngineCXX.o
[1106/1798] CXX obj/clang/lib/StaticAnalyzer/Frontend/Frontend.AnalyzerHelpFlags.o
[1107/1798] CXX obj/clang/lib/StaticAnalyzer/Core/Core.CheckerHelpers.o
[1108/1798] CXX obj/clang/lib/StaticAnalyzer/Core/Core.ProgramState.o
[1109/1798] CXX obj/clang/lib/Sema/Sema.SemaExprCXX.o
[1110/1798] CXX obj/clang/lib/StaticAnalyzer/Core/Core.Environment.o
[1111/1798] CXX obj/clang/lib/StaticAnalyzer/Core/Core.EntryPointStats.o
[1112/1798] CXX obj/clang/lib/StaticAnalyzer/Core/Core.CheckerContext.o
[1113/1798] CXX obj/clang/lib/StaticAnalyzer/Core/Core.BugSuppression.o
[1114/1798] CXX obj/clang/lib/StaticAnalyzer/Core/Core.CallDescription.o
[1115/1798] CXX obj/clang/lib/StaticAnalyzer/Core/Core.SValBuilder.o
[1116/1798] CXX obj/clang/lib/StaticAnalyzer/Checkers/WebKit/Checkers.MemoryUnsafeCastChecker.o
[1117/1798] CXX obj/clang/lib/Sema/Sema.SemaTemplateInstantiate.o
[1118/1798] CXX obj/clang/lib/StaticAnalyzer/Core/Core.DynamicType.o
[1119/1798] CXX obj/clang/lib/Serialization/Serialization.ASTWriter.o
[1120/1798] CXX obj/clang/lib/StaticAnalyzer/Core/Core.CoreEngine.o
[1121/1798] CXX obj/clang/lib/Tooling/Tooling.GuessTargetAndModeCompilationDatabase.o
[1122/1798] CXX obj/clang/lib/StaticAnalyzer/Checkers/Checkers.StdLibraryFunctionsChecker.o
[1123/1798] CXX obj/clang/lib/StaticAnalyzer/Core/Core.CallEvent.o
[1124/1798] CXX obj/clang/lib/StaticAnalyzer/Core/Core.CheckerManager.o
[1125/1798] CXX obj/clang/lib/Tooling/Tooling.LocateToolCompilationDatabase.o
[1126/1798] CXX obj/clang/lib/Testing/Testing.TestAST.o
[1127/1798] AR lib/libclangTesting.a
[1128/1798] CXX obj/clang/lib/StaticAnalyzer/Core/Core.RangeConstraintManager.o
[1129/1798] CXX obj/clang/lib/Tooling/Tooling.Refactoring.o
[1130/1798] CXX obj/clang/lib/Tooling/Tooling.JSONCompilationDatabase.o
[1131/1798] CXX obj/clang/lib/StaticAnalyzer/Core/Core.ExprEngine.o
[1132/1798] CXX obj/clang/lib/StaticAnalyzer/Frontend/Frontend.ModelInjector.o
[1133/1798] CXX obj/clang/lib/Sema/Sema.SemaTemplate.o
[1134/1798] CXX obj/clang/lib/Tooling/Tooling.AllTUsExecution.o
[1135/1798] CXX obj/clang/lib/StaticAnalyzer/Core/Core.LoopUnrolling.o
[1136/1798] CXX obj/clang/lib/Tooling/Tooling.CompilationDatabase.o
[1137/1798] CXX obj/clang/lib/Serialization/Serialization.ASTReader.o
[1138/1798] CXX obj/clang/lib/Tooling/Refactoring/Rename/Refactoring.RenamingAction.o
[1139/1798] CXX obj/clang/tools/diagtool/diagtool.ShowEnabledWarnings.o
[1140/1798] CXX obj/clang/lib/StaticAnalyzer/Core/Core.BugReporter.o
[1141/1798] CXX obj/clang/lib/Tooling/Transformer/Transformer.Parsing.o
[1142/1798] CXX obj/clang/tools/clang-check/clang-check.ClangCheck.o
[1143/1798] CXX obj/clang/lib/Tooling/Transformer/Transformer.SourceCodeBuilders.o
[1144/1798] CXX obj/clang/tools/clang-extdef-mapping/clang-extdef-mapping.ClangExtDefMapGen.o
[1145/1798] CXX obj/clang/lib/Tooling/Transformer/Transformer.RewriteRule.o
[1146/1798] CXX obj/clang/lib/Tooling/Transformer/Transformer.Transformer.o
[1147/1798] CXX obj/clang/tools/clang-diff/clang-diff.ClangDiff.o
[1148/1798] CXX obj/clang/tools/driver/clang.driver.o
[1149/1798] CXX obj/clang/lib/Tooling/DependencyScanning/DependencyScanning.DependencyScanningTool.o
[1150/1798] CXX obj/clang/tools/libclang/libclang.CXCursor.o
[1151/1798] CXX obj/clang/tools/clang-import-test/clang-import-test.clang-import-test.o
[1152/1798] CXX obj/clang/lib/Tooling/Refactoring/Refactoring.AtomicChange.o
[1153/1798] CXX obj/clang/lib/StaticAnalyzer/Checkers/WebKit/Checkers.ForwardDeclChecker.o
[1154/1798] CXX obj/clang/lib/Tooling/Transformer/Transformer.RangeSelector.o
[1155/1798] CXX obj/clang/lib/CodeGen/CodeGen.CGBuiltin.o
[1156/1798] CXX obj/clang/lib/Tooling/Transformer/Transformer.Stencil.o
[1157/1798] CXX obj/clang/lib/StaticAnalyzer/Core/Core.RegionStore.o
[1158/1798] CXX obj/clang/lib/Tooling/Refactoring/Refactoring.RefactoringActions.o
[1159/1798] CXX obj/clang/tools/c-index-test/c-index-test.core_main.o
[1160/1798] CXX obj/clang/lib/StaticAnalyzer/Checkers/WebKit/Checkers.RetainPtrCtorAdoptChecker.o
[1161/1798] CXX obj/clang/unittests/AST/ASTTests.SizelessTypesTest.o
[1162/1798] CXX obj/clang/tools/libclang/libclang.CIndexCodeCompletion.o
[1163/1798] CXX obj/clang/unittests/AST/ASTTests.RawCommentForDeclTest.o
[1164/1798] CXX obj/clang/tools/clang-refactor/clang-refactor.ClangRefactor.o
[1165/1798] CXX obj/clang/lib/StaticAnalyzer/Core/Core.BugReporterVisitors.o
[1166/1798] CXX obj/clang/lib/Tooling/DependencyScanning/DependencyScanning.DependencyScanningWorker.o
[1167/1798] CXX obj/clang/lib/Tooling/DependencyScanning/DependencyScanning.ModuleDepCollector.o
[1168/1798] CXX obj/clang/tools/clang-installapi/clang-installapi.ClangInstallAPI.o
[1169/1798] CXX obj/clang/tools/driver/clang.cc1_main.o
[1170/1798] CXX obj/clang/unittests/AST/ASTTests.ASTExprTest.o
[1171/1798] CXX obj/clang/unittests/AST/ASTTests.ASTImporterObjCTest.o
[1172/1798] CXX obj/clang/unittests/Analysis/ClangAnalysisTests.CloneDetectionTest.o
[1173/1798] CXX obj/clang/tools/libclang/libclang.Indexing.o
[1174/1798] CXX obj/clang/unittests/Analysis/ClangAnalysisTests.MacroExpansionContextTest.o
[1175/1798] CXX obj/clang/unittests/AST/ASTTests.ExternalASTSourceTest.o
[1176/1798] CXX obj/clang/tools/clang-repl/clang-repl.ClangRepl.o
[1177/1798] CXX obj/clang/unittests/AST/ASTTests.EvaluateAsRValueTest.o
[1178/1798] CXX obj/clang/unittests/AST/ASTTests.ASTTypeTraitsTest.o
[1179/1798] CXX obj/clang/unittests/AST/ASTTests.TemplateNameTest.o
[1180/1798] CXX obj/clang/unittests/AST/ASTTests.StmtPrinterTest.o
[1181/1798] CXX obj/clang/lib/Sema/Sema.SemaExpr.o
[1182/1798] CXX obj/clang/unittests/AST/ASTTests.TypePrinterTest.o
[1183/1798] CXX obj/clang/unittests/AST/ASTTests.DeclBaseTest.o
[1184/1798] CXX obj/clang/unittests/Analysis/FlowSensitive/ClangAnalysisFlowSensitiveTests.DataflowAnalysisContextTest.o
[1185/1798] CXX obj/clang/unittests/AST/ByteCode/InterpTests.Descriptor.o
[1186/1798] CXX obj/clang/unittests/AST/ByteCode/InterpTests.toAPValue.o
[1187/1798] CXX obj/clang/lib/Tooling/ASTDiff/ASTDiff.ASTDiff.o
[1188/1798] AR lib/libclangToolingASTDiff.a
[1189/1798] CXX obj/clang/lib/Tooling/Refactoring/Refactoring.ASTSelection.o
[1190/1798] CXX obj/clang/unittests/AST/ASTTests.ProfilingTest.o
[1191/1798] CXX obj/clang/unittests/AST/ASTTests.NamedDeclPrinterTest.o
[1192/1798] CXX obj/clang/lib/Tooling/Refactoring/Rename/Refactoring.USRFindingAction.o
[1193/1798] CXX obj/clang/unittests/AST/ASTTests.RandstructTest.o
[1194/1798] LINK obj/clang/unittests/InstallAPI/InstallAPITests
[1195/1798] CXX obj/clang/unittests/AST/ASTTests.ConceptPrinterTest.o
[1196/1798] CXX obj/clang/tools/libclang/libclang.CIndex.o
[1197/1798] CXX obj/clang/unittests/AST/ASTTests.DeclTest.o
[1198/1798] CXX obj/clang/unittests/ASTMatchers/ASTMatchersTests.GtestMatchersTest.o
[1199/1798] CXX obj/clang/unittests/ASTMatchers/Dynamic/DynamicASTMatchersTests.VariantValueTest.o
[1200/1798] CXX obj/clang/lib/Tooling/Syntax/Syntax.BuildTree.o
[1201/1798] CXX obj/clang/unittests/AST/ASTTests.ASTImporterFixtures.o
[1202/1798] CXX obj/clang/unittests/Analysis/ClangAnalysisTests.CFGTest.o
[1203/1798] CXX obj/clang/unittests/AST/ASTTests.DeclPrinterTest.o
[1204/1798] CXX obj/clang/unittests/Analysis/FlowSensitive/ClangAnalysisFlowSensitiveTests.WatchedLiteralsSolverTest.o
[1205/1798] CXX obj/clang/unittests/AST/ASTTests.DataCollectionTest.o
[1206/1798] CXX obj/clang/unittests/AST/ASTTests.SourceLocationTest.o
[1207/1798] CXX obj/clang/unittests/ASTMatchers/ASTMatchersTests.ASTMatchersInternalTest.o
[1208/1798] CXX obj/clang/unittests/ASTMatchers/Dynamic/DynamicASTMatchersTests.RegistryTest.o
[1209/1798] CXX obj/clang/unittests/AST/ASTTests.AttrTest.o
[1210/1798] CXX obj/clang/unittests/Analysis/FlowSensitive/ClangAnalysisFlowSensitiveTests.CFGMatchSwitchTest.o
[1211/1798] CXX obj/clang/unittests/AST/ASTTests.ASTContextParentMapTest.o
[1212/1798] CXX obj/clang/lib/Tooling/Refactoring/Rename/Refactoring.USRFinder.o
[1213/1798] CXX obj/clang/lib/Sema/Sema.SemaOpenMP.o
[1214/1798] AR lib/libclangSema.a
[1215/1798] AR lib/libclangParse.a
[1216/1798] AR lib/libclangSerialization.a
[1217/1798] AR lib/libclangFrontend.a
[1218/1798] CXX obj/clang/unittests/Analysis/FlowSensitive/ClangAnalysisFlowSensitiveTests.CachedConstAccessorsLatticeTest.o
[1219/1798] AR lib/libclangQuery.a
[1220/1798] CXX obj/clang/unittests/AST/ASTTests.StructuralEquivalenceTest.o
[1221/1798] AR lib/libclangRewriteFrontend.a
[1222/1798] AR lib/libclangCodeGen.a
[1223/1798] AR lib/libclangIndex.a
[1224/1798] AR lib/libclangTooling.a
[1225/1798] AR lib/libclangReorderFields.a
[1226/1798] AR lib/libclangChangeNamespace.a
[1227/1798] AR lib/libclangDoc.a
[1228/1798] AR lib/libfindAllSymbols.a
[1229/1798] LINK obj/clang/unittests/Format/FormatTests
[1230/1798] AR lib/libclangMove.a
[1231/1798] CXX obj/clang/unittests/AST/ASTTests.RecursiveASTVisitorTest.o
[1232/1798] AR lib/libclangIncludeFixer.a
[1233/1798] CXX obj/clang/unittests/Analysis/FlowSensitive/ClangAnalysisFlowSensitiveTests.MapLatticeTest.o
[1234/1798] CXX obj/clang/unittests/ASTMatchers/Dynamic/DynamicASTMatchersTests.ParserTest.o
[1235/1798] CXX obj/clang/unittests/Analysis/FlowSensitive/ClangAnalysisFlowSensitiveTests.DeterminismTest.o
[1236/1798] CXX obj/clang/unittests/Analysis/FlowSensitive/ClangAnalysisFlowSensitiveTests.ASTOpsTest.o
[1237/1798] CXX obj/clang/lib/Tooling/Refactoring/Rename/Refactoring.USRLocFinder.o
[1238/1798] LINK ./bin/find-all-symbols
[1239/1798] LINK ./bin/clang-change-namespace
[1240/1798] LINK ./bin/clang-move
[1241/1798] LINK ./bin/clang-doc
[1242/1798] LINK ./bin/clang-include-fixer
[1243/1798] LINK ./bin/clang-reorder-fields
[1244/1798] LINK ./bin/clang-query
[1245/1798] LINK obj/clang/unittests/ASTMatchers/Dynamic/DynamicASTMatchersTests
[1246/1798] AR lib/libclangCrossTU.a
[1247/1798] CXX obj/clang/unittests/Analysis/FlowSensitive/ClangAnalysisFlowSensitiveTests.DebugSupportTest.o
[1248/1798] AR lib/libclangExtractAPI.a
[1249/1798] CXX obj/clang/unittests/Analysis/ClangAnalysisTests.ExprMutationAnalyzerTest.o
[1250/1798] AR lib/libclangStaticAnalyzerCore.a
[1251/1798] CXX obj/clang/unittests/Driver/ClangDriverTests.DXCModeTest.o
[1252/1798] AR lib/libclangToolingRefactoring.a
[1253/1798] AR lib/libclangToolingSyntax.a
[1254/1798] AR lib/libclangApplyReplacements.a
[1255/1798] AR lib/libclangStaticAnalyzerCheckers.a
[1256/1798] LINK obj/clang-tools-extra/unittests/clang-query/ClangQueryTests
[1257/1798] AR lib/libclangStaticAnalyzerFrontend.a
[1258/1798] AR lib/libclangTidy.a
[1259/1798] AR lib/libclangFrontendTool.a
[1260/1798] LINK obj/clang-tools-extra/unittests/clang-change-namespace/ClangChangeNamespaceTests
[1261/1798] AR lib/libclangToolingTransformer.a
[1262/1798] AR lib/libclangInterpreter.a
[1263/1798] AR lib/libclangTidyUtils.a
[1264/1798] AR lib/libclangToolingDependencyScanning.a
[1265/1798] AR lib/libclangTidyMPIModule.a
[1266/1798] LINK ./bin/modularize
[1267/1798] LINK ./bin/pp-trace
[1268/1798] AR lib/libclangTidyAbseilModule.a
[1269/1798] AR lib/libclangTidyAndroidModule.a
[1270/1798] AR lib/libclangTidyAlteraModule.a
[1271/1798] AR lib/libclangTidyBoostModule.a
[1272/1798] AR lib/libclangTidyDarwinModule.a
[1273/1798] AR lib/libclangTidyConcurrencyModule.a
[1274/1798] AR lib/libclangTidyLinuxKernelModule.a
[1275/1798] AR lib/libclangTidyLLVMLibcModule.a
[1276/1798] AR lib/libclangTidyPortabilityModule.a
[1277/1798] AR lib/libclangTidyObjCModule.a
[1278/1798] AR lib/libclangTidyPerformanceModule.a
[1279/1798] AR lib/libclangTidyMiscModule.a
[1280/1798] AR lib/libclangTidyOpenMPModule.a
[1281/1798] AR lib/libclangTidyZirconModule.a
[1282/1798] AR lib/libclangTidyReadabilityModule.a
[1283/1798] AR lib/libclangTidyModernizeModule.a
[1284/1798] AR lib/libclangTidyCppCoreGuidelinesModule.a
[1285/1798] AR lib/libclangTidyBugproneModule.a
[1286/1798] AR lib/libclangTidyGoogleModule.a
[1287/1798] AR lib/libclangTidyFuchsiaModule.a
[1288/1798] LINK ./bin/clang-apply-replacements
[1289/1798] AR lib/libclangTidyCERTModule.a
[1290/1798] AR lib/libclangTidyLLVMModule.a
[1291/1798] CXX obj/clang/unittests/Frontend/FrontendTests.CompilerInstanceTest.o
[1292/1798] LINK obj/clang-tools-extra/unittests/clang-doc/ClangDocTests
[1293/1798] AR lib/libclangTidyHICPPModule.a
[1294/1798] LINK obj/clang-tools-extra/unittests/clang-apply-replacements/ClangApplyReplacementsTests
[1295/1798] STAMP obj/clang-tools-extra/clang-tidy/all-checks.stamp
[1296/1798] LINK obj/clang-tools-extra/unittests/clang-include-fixer/ClangIncludeFixerTests
[1297/1798] AR lib/libclangDaemon.a
[1298/1798] STAMP obj/clang-tools-extra/clangd/refactor/tweaks/tweaks.stamp
[1299/1798] LINK obj/clang-tools-extra/unittests/clang-include-fixer/find-all-symbols/FindAllSymbolsTests
[1300/1798] LINK obj/clang-tools-extra/unittests/clang-move/ClangMoveTests
[1301/1798] LINK ./bin/clang-diff
[1302/1798] CXX obj/clang/unittests/Analysis/FlowSensitive/ClangAnalysisFlowSensitiveTests.SmartPointerAccessorCachingTest.o
[1303/1798] LINK ./bin/clang-refactor
[1304/1798] LINK ./bin/clang-installapi
[1305/1798] CXX obj/clang/unittests/Analysis/FlowSensitive/ClangAnalysisFlowSensitiveTests.ChromiumCheckModelTest.o
[1306/1798] LINK ./bin/diagtool
[1307/1798] LINK ./bin/clang-extdef-mapping
[1308/1798] LINK ./bin/clang-scan-deps
[1309/1798] LINK ./bin/clang-import-test
[1310/1798] LINK obj/clang-tools-extra/unittests/clang-tidy/ClangTidyTests
[1311/1798] STAMP obj/clang-tools-extra/unittests/unittests.stamp
[1312/1798] LINK ./bin/dexp
[1313/1798] CXX obj/clang/unittests/AST/ASTTests.ASTImporterVisibilityTest.o
[1314/1798] LINK ./bin/clang-tidy
[1315/1798] CXX obj/clang/unittests/Analysis/FlowSensitive/ClangAnalysisFlowSensitiveTests.LoggerTest.o
[1316/1798] LINK obj/clang/unittests/AST/ByteCode/InterpTests
[1317/1798] CXX obj/clang/tools/libclang/libclang.CXExtractAPI.o
[1318/1798] LINK ./bin/clangd-indexer
[1319/1798] LINK ./bin/clang-check
[1320/1798] LINK ./bin/clangd
[1321/1798] LINK obj/clang/unittests/CrossTU/CrossTUTests
[1322/1798] LINK obj/clang-tools-extra/clangd/unittests/ClangdTests
[1323/1798] STAMP obj/clang-tools-extra/clangd/test/test.stamp
[1324/1798] CXX obj/clang/unittests/AST/ASTTests.ASTImporterGenericRedeclTest.o
[1325/1798] LINK ./bin/clang-repl
[1326/1798] CXX obj/clang/unittests/Analysis/FlowSensitive/ClangAnalysisFlowSensitiveTests.MatchSwitchTest.o
[1327/1798] LINK obj/clang/unittests/Interpreter/ExceptionTests/ClangReplInterpreterExceptionTests
[1328/1798] LINK ./bin/clang
[1329/1798] CXX obj/clang/unittests/Analysis/FlowSensitive/ClangAnalysisFlowSensitiveTests.DataflowEnvironmentTest.o
[1330/1798] ACTION //clang/tools/driver:clang-cpp(//llvm/utils/gn/build/toolchain:unix)
[1331/1798] ACTION //clang/tools/driver:clang-cl(//llvm/utils/gn/build/toolchain:unix)
[1332/1798] STAMP obj/clang/tools/driver/clang-cl.stamp
[1333/1798] STAMP obj/clang/tools/driver/clang-cpp.stamp
[1334/1798] CXX obj/clang/unittests/Analysis/FlowSensitive/ClangAnalysisFlowSensitiveTests.RecordOpsTest.o
[1335/1798] ACTION //clang/tools/driver:clangxx(//llvm/utils/gn/build/toolchain:unix)
[1336/1798] STAMP obj/clang/tools/driver/clangxx.stamp
[1337/1798] STAMP obj/clang/tools/driver/symlinks.stamp
[1338/1798] STAMP obj/clang.stamp
[1339/1798] STAMP obj/bolt/test/test.stamp
[1340/1798] LINK obj/clang/unittests/Driver/ClangDriverTests
[1341/1798] CXX obj/clang/unittests/Frontend/FrontendTests.ASTUnitTest.o
[1342/1798] CXX obj/clang/unittests/AST/ASTTests.ASTTraverserTest.o
[1343/1798] SOLINK ./lib/libclang.so
[1344/1798] CXX obj/clang/unittests/Analysis/ClangAnalysisTests.IntervalPartitionTest.o
[1345/1798] CXX obj/clang/unittests/Analysis/FlowSensitive/ClangAnalysisFlowSensitiveTests.SimplifyConstraintsTest.o
[1346/1798] CXX obj/clang/unittests/Serialization/SerializationTests.LoadSpecLazilyTest.o
[1347/1798] CXX obj/clang/unittests/StaticAnalyzer/StaticAnalysisTests.ExprEngineVisitTest.o
[1348/1798] LINK ./bin/c-index-test
[1349/1798] STAMP obj/clang-tools-extra/test/test.stamp
[1350/1798] CXX obj/clang/unittests/Frontend/FrontendTests.CodeGenActionTest.o
[1351/1798] CXX obj/clang/unittests/CodeGen/ClangCodeGenTests.BufferSourceTest.o
[1352/1798] CXX obj/clang/unittests/Analysis/ClangAnalysisTests.CFGDominatorTree.o
[1353/1798] CXX obj/clang/unittests/Analysis/FlowSensitive/ClangAnalysisFlowSensitiveTests.TestingSupport.o
[1354/1798] LINK obj/clang/unittests/CodeGen/ClangCodeGenTests
[1355/1798] LINK obj/clang/unittests/Analysis/ClangAnalysisTests
[1356/1798] CXX obj/clang/unittests/Analysis/FlowSensitive/ClangAnalysisFlowSensitiveTests.TestingSupportTest.o
[1357/1798] CXX obj/clang/unittests/Tooling/ToolingTests.CastExprTest.o
[1358/1798] CXX obj/clang/unittests/Analysis/FlowSensitive/ClangAnalysisFlowSensitiveTests.TransferBranchTest.o
[1359/1798] CXX obj/clang/unittests/Lex/LexTests.PPCallbacksTest.o
[1360/1798] CXX obj/clang/unittests/StaticAnalyzer/StaticAnalysisTests.SValSimplifyerTest.o
[1361/1798] CXX obj/clang/unittests/StaticAnalyzer/StaticAnalysisTests.CallEventTest.o
[1362/1798] CXX obj/clang/unittests/Support/ClangSupportTests.TimeProfilerTest.o
[1363/1798] LINK obj/clang/unittests/Lex/LexTests
[1364/1798] CXX obj/clang/unittests/StaticAnalyzer/StaticAnalysisTests.IsCLibraryFunctionTest.o
[1365/1798] CXX obj/clang/unittests/Analysis/FlowSensitive/ClangAnalysisFlowSensitiveTests.SignAnalysisTest.o
[1366/1798] CXX obj/clang/unittests/Index/IndexTests.IndexTests.o
[1367/1798] CXX obj/clang/unittests/StaticAnalyzer/StaticAnalysisTests.Z3CrosscheckOracleTest.o
[1368/1798] CXX obj/clang/unittests/Serialization/SerializationTests.NoCommentsTest.o
[1369/1798] CXX obj/clang/unittests/Analysis/FlowSensitive/ClangAnalysisFlowSensitiveTests.SingleVarConstantPropagationTest.o
[1370/1798] CXX obj/clang/unittests/StaticAnalyzer/StaticAnalysisTests.ObjcBug-124477.o
[1371/1798] CXX obj/clang/unittests/Sema/SemaTests.GslOwnerPointerInference.o
[1372/1798] CXX obj/clang/unittests/Analysis/FlowSensitive/ClangAnalysisFlowSensitiveTests.MultiVarConstantPropagationTest.o
[1373/1798] LINK obj/clang/unittests/Support/ClangSupportTests
[1374/1798] CXX obj/clang/unittests/StaticAnalyzer/StaticAnalysisTests.NoStateChangeFuncVisitorTest.o
[1375/1798] LINK obj/clang/unittests/Index/IndexTests
[1376/1798] CXX obj/clang/unittests/StaticAnalyzer/StaticAnalysisTests.RegisterCustomCheckersTest.o
[1377/1798] CXX obj/clang/unittests/StaticAnalyzer/StaticAnalysisTests.AnalyzerOptionsTest.o
[1378/1798] CXX obj/clang/unittests/Tooling/ToolingTests.ASTSelectionTest.o
[1379/1798] CXX obj/clang/unittests/Interpreter/ClangReplInterpreterTests.IncrementalCompilerBuilderTest.o
[1380/1798] CXX obj/clang/unittests/StaticAnalyzer/StaticAnalysisTests.ParamRegionTest.o
[1381/1798] CXX obj/clang/unittests/AST/ASTTests.ASTImporterODRStrategiesTest.o
[1382/1798] CXX obj/clang/unittests/Serialization/SerializationTests.VarDeclConstantInitTest.o
[1383/1798] CXX obj/clang/unittests/StaticAnalyzer/StaticAnalysisTests.APSIntTypeTest.o
[1384/1798] CXX obj/clang/unittests/Rewrite/RewriteTests.RewriterTest.o
[1385/1798] CXX obj/clang/unittests/Serialization/SerializationTests.ModuleCacheTest.o
[1386/1798] CXX obj/clang/unittests/StaticAnalyzer/StaticAnalysisTests.TestReturnValueUnderConstruction.o
[1387/1798] CXX obj/clang/unittests/Serialization/SerializationTests.PreambleInNamedModulesTest.o
[1388/1798] CXX obj/clang/unittests/StaticAnalyzer/StaticAnalysisTests.BugReportInterestingnessTest.o
[1389/1798] LINK obj/clang/unittests/Rewrite/RewriteTests
[1390/1798] CXX obj/clang/unittests/Analysis/FlowSensitive/ClangAnalysisFlowSensitiveTests.UncheckedOptionalAccessModelTest.o
[1391/1798] CXX obj/clang/unittests/Tooling/ToolingTests.RecursiveASTVisitorTestDeclVisitor.o
[1392/1798] CXX obj/clang/unittests/Tooling/ToolingTests.LookupTest.o
[1393/1798] CXX obj/clang/unittests/Tooling/ToolingTests.QualTypeNamesTest.o
[1394/1798] CXX obj/clang/unittests/StaticAnalyzer/StaticAnalysisTests.ConflictingEvalCallsTest.o
[1395/1798] CXX obj/clang/unittests/Tooling/ToolingTests.RecursiveASTVisitorTestTypeLocVisitor.o
[1396/1798] CXX obj/clang/unittests/StaticAnalyzer/StaticAnalysisTests.MemRegionDescriptiveNameTest.o
[1397/1798] CXX obj/clang/unittests/Tooling/RecursiveASTVisitorTests/ToolingTests.BitfieldInitializer.o
[1398/1798] CXX obj/clang/unittests/Tooling/RecursiveASTVisitorTests/ToolingTests.CXXMemberCall.o
[1399/1798] CXX obj/clang/unittests/Tooling/RecursiveASTVisitorTests/ToolingTests.CXXBoolLiteralExpr.o
[1400/1798] CXX obj/clang/unittests/StaticAnalyzer/StaticAnalysisTests.CallDescriptionTest.o
[1401/1798] CXX obj/clang/unittests/Sema/SemaTests.CodeCompleteTest.o
[1402/1798] CXX obj/clang/unittests/Tooling/RecursiveASTVisitorTests/ToolingTests.CXXMethodDecl.o
[1403/1798] CXX obj/clang/unittests/Frontend/FrontendTests.NoAlterCodeGenActionTest.o
[1404/1798] CXX obj/clang/unittests/Interpreter/ClangReplInterpreterTests.IncrementalProcessingTest.o
[1405/1798] CXX obj/clang/unittests/Sema/SemaTests.HeuristicResolverTest.o
[1406/1798] LINK obj/clang/unittests/libclang/CrashTests/libclangCrashTests
[1407/1798] CXX obj/clang/unittests/Tooling/RecursiveASTVisitorTests/ToolingTests.CXXOperatorCallExprTraverser.o
[1408/1798] CXX obj/clang/unittests/StaticAnalyzer/StaticAnalysisTests.SymbolReaperTest.o
[1409/1798] LINK obj/clang/unittests/libclang/libclangTests
[1410/1798] CXX obj/clang/unittests/StaticAnalyzer/StaticAnalysisTests.StoreTest.o
[1411/1798] LINK obj/clang/unittests/Frontend/FrontendTests
[1412/1798] LINK obj/clang/unittests/Sema/SemaTests
[1413/1798] CXX obj/clang/unittests/StaticAnalyzer/StaticAnalysisTests.FalsePositiveRefutationBRVisitorTest.o
[1414/1798] CXX obj/clang/unittests/Tooling/ToolingTests.HeaderAnalysisTest.o
[1415/1798] CXX obj/clang/unittests/Tooling/RecursiveASTVisitorTests/ToolingTests.Class.o
[1416/1798] CXX obj/clang/unittests/StaticAnalyzer/StaticAnalysisTests.SValTest.o
[1417/1798] CXX obj/clang/unittests/Tooling/ToolingTests.CommentHandlerTest.o
[1418/1798] CXX obj/clang/unittests/Interpreter/ClangReplInterpreterTests.InterpreterExtensionsTest.o
[1419/1798] CXX obj/clang/unittests/Tooling/RecursiveASTVisitorTests/ToolingTests.Concept.o
[1420/1798] CXX obj/clang/unittests/Tooling/ToolingTests.DiagnosticsYamlTest.o
[1421/1798] CXX obj/clang/unittests/Tooling/RecursiveASTVisitorTests/ToolingTests.IntegerLiteral.o
[1422/1798] CXX obj/clang/unittests/Tooling/RecursiveASTVisitorTests/ToolingTests.DeductionGuide.o
[1423/1798] CXX obj/clang/unittests/Serialization/SerializationTests.ForceCheckFileInputTest.o
[1424/1798] CXX obj/clang/unittests/Interpreter/ClangReplInterpreterTests.InterpreterTest.o
[1425/1798] CXX obj/clang/unittests/Tooling/RecursiveASTVisitorTests/ToolingTests.ConstructExpr.o
[1426/1798] CXX obj/clang/unittests/Analysis/FlowSensitive/ClangAnalysisFlowSensitiveTests.TypeErasedDataflowAnalysisTest.o
[1427/1798] CXX obj/clang/unittests/Tooling/RecursiveASTVisitorTests/ToolingTests.ImplicitCtorInitializer.o
[1428/1798] LINK obj/clang/unittests/Serialization/SerializationTests
[1429/1798] CXX obj/clang/unittests/Tooling/RecursiveASTVisitorTests/ToolingTests.ImplicitCtor.o
[1430/1798] CXX obj/clang/unittests/Tooling/RecursiveASTVisitorTests/ToolingTests.DeclRefExpr.o
[1431/1798] CXX obj/clang/unittests/Tooling/RecursiveASTVisitorTests/ToolingTests.InitListExprPreOrderNoQueue.o
[1432/1798] CXX obj/clang/unittests/Tooling/ToolingTests.ExecutionTest.o
[1433/1798] CXX obj/clang/unittests/Tooling/RecursiveASTVisitorTests/ToolingTests.InitListExprPreOrder.o
[1434/1798] CXX obj/clang/unittests/Tooling/ToolingTests.FixItTest.o
[1435/1798] LINK obj/clang/unittests/Interpreter/ClangReplInterpreterTests
[1436/1798] CXX obj/clang/unittests/Tooling/RecursiveASTVisitorTests/ToolingTests.LambdaExpr.o
[1437/1798] CXX obj/clang/unittests/Tooling/RecursiveASTVisitorTests/ToolingTests.LambdaDefaultCapture.o
[1438/1798] STAMP stage2_baremetal_aarch64/obj/compiler-rt/lib/builtins/builtins.inputdeps.stamp
[1439/1798] STAMP stage2_unix/obj/compiler-rt/lib/asan/asan_shared_library.inputdeps.stamp
[1440/1798] STAMP stage2_unix/obj/compiler-rt/lib/asan/asan_static_library.inputdeps.stamp
[1441/1798] STAMP stage2_unix/obj/compiler-rt/lib/builtins/builtins.inputdeps.stamp
[1442/1798] STAMP stage2_unix/obj/compiler-rt/lib/asan/static_sources.inputdeps.stamp
[1443/1798] STAMP stage2_unix/obj/compiler-rt/lib/profile/profile.inputdeps.stamp
[1444/1798] STAMP stage2_unix/obj/compiler-rt/lib/hwasan/sources.inputdeps.stamp
[1445/1798] STAMP stage2_unix/obj/compiler-rt/lib/msan/msan.inputdeps.stamp
[1446/1798] STAMP stage2_unix/obj/compiler-rt/lib/interception/sources.inputdeps.stamp
[1447/1798] STAMP stage2_unix/obj/compiler-rt/lib/lsan/common_sources.inputdeps.stamp
[1448/1798] STAMP stage2_unix/obj/compiler-rt/lib/sanitizer_common/sources.inputdeps.stamp
[1449/1798] STAMP stage2_unix/obj/libcxx/src/cxx_experimental.inputdeps.stamp
[1450/1798] STAMP stage2_unix/obj/compiler-rt/lib/scudo/standalone/sources.inputdeps.stamp
[1451/1798] STAMP stage2_unix/obj/compiler-rt/lib/tsan/rtl/rtl.inputdeps.stamp
[1452/1798] STAMP stage2_unix/obj/libcxx/src/cxx_shared.inputdeps.stamp
[1453/1798] ACTION //compiler-rt/test/asan:lit_site_cfg(//llvm/utils/gn/build/toolchain:stage2_unix)
[1454/1797] STAMP stage2_unix/obj/compiler-rt/lib/ubsan/sources.inputdeps.stamp
[1455/1797] STAMP stage2_unix/obj/compiler-rt/lib/ubsan/standalone_sources.inputdeps.stamp
[1456/1797] STAMP stage2_unix/obj/compiler-rt/lib/ubsan/cxx_sources.inputdeps.stamp
[1457/1797] CXX obj/clang/unittests/Tooling/RecursiveASTVisitorTests/ToolingTests.NestedNameSpecifiers.o
[1458/1797] CXX obj/clang/unittests/Tooling/RecursiveASTVisitorTests/ToolingTests.MemberPointerTypeLoc.o
[1459/1797] CXX obj/clang/unittests/Tooling/ToolingTests.RangeSelectorTest.o
[1460/1797] ACTION //compiler-rt/test:lit_common_configured(//llvm/utils/gn/build/toolchain:stage2_unix)
[1461/1794] ACTION //compiler-rt/test/hwasan:lit_site_cfg(//llvm/utils/gn/build/toolchain:stage2_unix)
[1462/1793] STAMP stage2_unix/obj/libcxxabi/src/cxxabi_static.inputdeps.stamp
[1463/1793] STAMP stage2_unix/obj/libcxx/src/cxx_static.inputdeps.stamp
[1464/1793] STAMP stage2_unix/obj/libcxxabi/src/cxxabi_shared.inputdeps.stamp
[1465/1793] STAMP stage2_unix/obj/libunwind/src/unwind_static.inputdeps.stamp
[1466/1793] STAMP stage2_unix/obj/libunwind/src/unwind_shared.inputdeps.stamp
[1467/1793] ACTION //compiler-rt/test/lsan:asan_mode_cfg(//llvm/utils/gn/build/toolchain:stage2_unix)
[1468/1790] STAMP stage2_unix/obj/libunwind/src/unwind_static_exported.inputdeps.stamp
[1469/1790] ACTION //libcxx/src:cxx_symlink(//llvm/utils/gn/build/toolchain:stage2_unix)
[1470/1790] STAMP stage2_unix/obj/libcxx/src/cxx_symlink.stamp
[1471/1790] ACTION //llvm/include/llvm/Config:AsmParsers.def(//llvm/utils/gn/build/toolchain:stage2_unix)
[1472/1789] ACTION //llvm/include/llvm/Config:AsmPrinters.def(//llvm/utils/gn/build/toolchain:stage2_unix)
[1473/1788] ACTION //libcxx/src:cxx_linker_script(//llvm/utils/gn/build/toolchain:stage2_unix)
[1474/1788] STAMP stage2_unix/obj/libcxx/src/cxx_linker_script.stamp
[1475/1788] STAMP stage2_unix/obj/libcxx/src/src.stamp
[1476/1788] STAMP obj/libcxx/libcxx.stamp
[1477/1788] ACTION //compiler-rt/lib/hwasan:version_script(//llvm/utils/gn/build/toolchain:stage2_unix)
[1478/1788] STAMP stage2_unix/obj/compiler-rt/lib/hwasan/version_script.stamp
[1479/1788] ACTION //llvm/include/llvm/Config:Disassemblers.def(//llvm/utils/gn/build/toolchain:stage2_unix)
[1480/1787] ACTION //llvm/include/llvm/Config:TargetExegesis.def(//llvm/utils/gn/build/toolchain:stage2_unix)
[1481/1786] ACTION //compiler-rt/lib/ubsan:version_script(//llvm/utils/gn/build/toolchain:stage2_unix)
[1482/1786] STAMP stage2_unix/obj/compiler-rt/lib/ubsan/version_script.stamp
[1483/1786] ACTION //llvm/include/llvm/Config:Targets.def(//llvm/utils/gn/build/toolchain:stage2_unix)
[1484/1785] ACTION //llvm/include/llvm/Config:TargetMCAs.def(//llvm/utils/gn/build/toolchain:stage2_unix)
[1485/1783] CXX obj/clang/unittests/Tooling/DependencyScanning/ToolingTests.DependencyScannerTest.o
[1486/1783] ACTION //llvm/include/llvm/Config:abi-breaking(//llvm/utils/gn/build/toolchain:stage2_unix)
[1487/1781] CXX obj/clang/unittests/Tooling/RecursiveASTVisitorTests/ToolingTests.LambdaTemplateParams.o
[1488/1781] STAMP stage2_unix/obj/llvm/lib/Demangle/Demangle.inputdeps.stamp
[1489/1781] ACTION //llvm/include/llvm/Config:llvm-config(//llvm/utils/gn/build/toolchain:stage2_unix)
[1490/1622] CXX obj/clang/unittests/Tooling/RecursiveASTVisitorTests/ToolingTests.ParenExpr.o
[1491/1622] STAMP stage2_unix/obj/llvm/lib/Support/BLAKE3/BLAKE3.inputdeps.stamp
[1492/1622] ACTION //llvm/include/llvm/Support:write_vcsrevision(//llvm/utils/gn/build/toolchain:stage2_unix)
[1493/1621] ACTION //llvm/include/llvm/Support:write_extension_def(//llvm/utils/gn/build/toolchain:stage2_unix)
[1494/1620] ACTION //llvm/include/llvm/Config:config(//llvm/utils/gn/build/toolchain:stage2_unix)
[1495/1587] STAMP stage2_unix/obj/compiler-rt/lib/scudo/standalone/tests/ScudoCxxUnitTest.inputdeps.stamp
[1496/1587] STAMP stage2_unix/obj/compiler-rt/lib/scudo/standalone/tests/ScudoCUnitTest.inputdeps.stamp
[1497/1587] STAMP stage2_unix/obj/compiler-rt/lib/scudo/standalone/tests/ScudoUnitTest.inputdeps.stamp
[1498/1587] STAMP stage2_unix/obj/llvm/lib/Support/Support.inputdeps.stamp
[1499/1587] STAMP stage2_unix/obj/third-party/unittest/gtest.inputdeps.stamp
[1500/1587] CXX obj/clang/unittests/Tooling/RecursiveASTVisitorTests/ToolingTests.TraversalScope.o
[1501/1587] CXX obj/clang/unittests/Tooling/ToolingTests.ReplacementsYamlTest.o
[1502/1587] CXX obj/clang/unittests/Tooling/ToolingTests.CompilationDatabaseTest.o
[1503/1587] SOLINK lib/clang/21/lib/linux/libclang_rt.hwasan_aliases-x86_64.so
[1504/1587] SOLINK lib/clang/21/lib/linux/libclang_rt.ubsan_standalone-x86_64.so
[1505/1587] STAMP stage2_unix/obj/compiler-rt/test/hwasan/hwasan_toolchain.stamp
[1506/1587] STAMP obj/compiler-rt/test/hwasan/hwasan.stamp
[1507/1587] STAMP stage2_unix/obj/compiler-rt/lib/ubsan/ubsan.stamp
[1508/1587] STAMP stage2_unix/obj/compiler-rt/lib/lib.stamp
[1509/1587] STAMP obj/compiler-rt/compiler-rt.stamp
[1510/1587] CXX obj/clang/unittests/ASTMatchers/ASTMatchersTests.ASTMatchersNodeTest.o
[1511/1587] CXX obj/clang/unittests/Tooling/RecursiveASTVisitorTests/ToolingTests.TemplateArgumentLocTraverser.o
[1512/1587] CXX obj/clang/unittests/Tooling/ToolingTests.RefactoringActionRulesTest.o
[1513/1587] CXX obj/clang/unittests/Tooling/ToolingTests.StandardLibraryTest.o
[1514/1587] CXX obj/lldb/source/Plugins/ExpressionParser/Clang/Clang.ASTUtils.o
[1515/1587] CXX obj/clang/unittests/ASTMatchers/ASTMatchersTests.ASTMatchersNarrowingTest.o
[1516/1587] CXX obj/clang/unittests/Tooling/Syntax/SyntaxTests.MutationsTest.o
[1517/1587] CXX obj/clang/unittests/Tooling/Syntax/SyntaxTests.BuildTreeTest.o
[1518/1587] CXX obj/clang/unittests/Tooling/Syntax/SyntaxTests.SynthesisTest.o
[1519/1587] CXX obj/clang/unittests/Tooling/Syntax/SyntaxTests.TreeTestBase.o
[1520/1587] CXX obj/clang/unittests/Tooling/Syntax/SyntaxTests.TreeTest.o
[1521/1587] CXX obj/clang/unittests/Tooling/RecursiveASTVisitorTests/ToolingTests.Attr.o
[1522/1587] CXX obj/clang/unittests/Tooling/ToolingTests.RecursiveASTVisitorTestPostOrderVisitor.o
[1523/1587] CXX obj/clang/unittests/Tooling/ToolingTests.RefactoringCallbacksTest.o
[1524/1587] CXX obj/clang/unittests/Tooling/ToolingTests.ToolingTest.o
[1525/1587] CXX obj/clang/unittests/Tooling/ToolingTests.LexicallyOrderedRecursiveASTVisitorTest.o
[1526/1587] CXX obj/clang/unittests/Tooling/ToolingTests.SourceCodeBuildersTest.o
[1527/1587] CXX obj/clang/unittests/Tooling/ToolingTests.RefactoringTest.o
[1528/1587] CXX obj/clang/unittests/Tooling/Syntax/SyntaxTests.TokensTest.o
[1529/1587] CXX obj/lldb/source/Plugins/ExpressionParser/Clang/Clang.ASTStructExtractor.o
[1530/1587] CXX obj/clang/unittests/StaticAnalyzer/StaticAnalysisTests.RangeSetTest.o
[1531/1587] CXX obj/lldb/source/Plugins/ExpressionParser/Clang/Clang.CxxModuleHandler.o
[1532/1587] CXX obj/clang/unittests/Analysis/FlowSensitive/ClangAnalysisFlowSensitiveTests.TransferTest.o
[1533/1587] CXX obj/lldb/source/Plugins/ExpressionParser/Clang/Clang.NameSearchContext.o
[1534/1587] LINK obj/clang/unittests/Tooling/Syntax/SyntaxTests
[1535/1587] LINK obj/clang/unittests/StaticAnalyzer/StaticAnalysisTests
[1536/1587] CXX obj/clang/unittests/Tooling/RecursiveASTVisitorTests/ToolingTests.InitListExprPostOrderNoQueue.o
[1537/1587] LINK obj/clang/unittests/Analysis/FlowSensitive/ClangAnalysisFlowSensitiveTests
[1538/1587] CXX obj/lldb/source/Plugins/Language/CPlusPlus/CPlusPlus.BlockPointer.o
[1539/1587] CXX obj/lldb/source/Plugins/ExpressionParser/Clang/Clang.ClangPersistentVariables.o
[1540/1587] CXX obj/lldb/source/Plugins/ExpressionParser/Clang/Clang.ClangUtilityFunction.o
[1541/1587] CXX obj/lldb/source/Plugins/ExpressionParser/Clang/Clang.ClangFunctionCaller.o
[1542/1587] CXX obj/lldb/source/Plugins/ExpressionParser/Clang/Clang.ClangASTSource.o
[1543/1587] CXX obj/lldb/source/Plugins/ExpressionParser/Clang/Clang.ASTResultSynthesizer.o
[1544/1587] CXX obj/clang/unittests/Tooling/ToolingTests.SourceCodeTest.o
[1545/1587] CXX obj/clang/unittests/Tooling/RecursiveASTVisitorTests/ToolingTests.InitListExprPostOrder.o
[1546/1587] CXX obj/lldb/source/Plugins/ExpressionParser/Clang/Clang.ClangUserExpression.o
[1547/1587] CXX obj/lldb/source/Plugins/ExpressionParser/Clang/Clang.ClangModulesDeclVendor.o
[1548/1587] CXX obj/lldb/source/Commands/Commands.CommandObjectTarget.o
[1549/1587] AR lib/liblldbCommands.a
[1550/1587] CXX obj/lldb/source/Plugins/ExpressionParser/Clang/Clang.IRForTarget.o
[1551/1587] CXX obj/lldb/source/Plugins/ExpressionParser/Clang/Clang.ClangASTImporter.o
[1552/1587] CXX obj/clang/unittests/Tooling/ToolingTests.StencilTest.o
[1553/1587] CXX obj/lldb/source/Plugins/SymbolFile/PDB/PDB.PDBASTParser.o
[1554/1587] CXX obj/lldb/source/Plugins/SymbolFile/NativePDB/NativePDB.PdbAstBuilder.o
[1555/1587] CXX obj/lldb/source/Plugins/SymbolFile/PDB/PDB.SymbolFilePDB.o
[1556/1587] CXX obj/lldb/source/Plugins/SymbolFile/NativePDB/NativePDB.UdtRecordCompleter.o
[1557/1587] CXX obj/lldb/source/Plugins/ExpressionParser/Clang/Clang.ClangExpressionDeclMap.o
[1558/1587] CXX obj/lldb/source/Plugins/SymbolFile/NativePDB/NativePDB.SymbolFileNativePDB.o
[1559/1587] AR lib/liblldbPluginSymbolFileNativePDB.a
[1560/1587] AR lib/liblldbPluginSymbolFilePDB.a
[1561/1587] CXX obj/lldb/source/Plugins/ExpressionParser/Clang/Clang.ClangExpressionParser.o
[1562/1587] AR lib/liblldbPluginExpressionParserClang.a
[1563/1587] CXX obj/lldb/source/Plugins/SymbolFile/DWARF/DWARF.SymbolFileDWARF.o
[1564/1587] AR lib/liblldbPluginSymbolFileDWARF.a
[1565/1587] CXX obj/clang/unittests/Tooling/ToolingTests.TransformerTest.o
[1566/1587] CXX obj/lldb/source/Plugins/TypeSystem/Clang/Clang.TypeSystemClang.o
[1567/1587] AR lib/liblldbPluginTypeSystemClang.a
[1568/1587] AR lib/liblldbPluginCPlusPlusLanguage.a
[1569/1587] STAMP obj/lldb/source/Plugins/LldbAllPlugins.stamp
[1570/1587] CXX obj/clang/unittests/Tooling/RecursiveASTVisitorTests/ToolingTests.CallbacksUnaryOperator.o
[1571/1587] CXX obj/clang/unittests/Tooling/RecursiveASTVisitorTests/ToolingTests.CallbacksCallExpr.o
[1572/1587] LINK ./bin/lldb-server
[1573/1587] CXX obj/clang/unittests/ASTMatchers/ASTMatchersTests.ASTMatchersTraversalTest.o
[1574/1587] CXX obj/clang/unittests/Tooling/RecursiveASTVisitorTests/ToolingTests.CallbacksLeaf.o
[1575/1587] CXX obj/clang/unittests/Tooling/RecursiveASTVisitorTests/ToolingTests.CallbacksBinaryOperator.o
[1576/1587] LINK obj/clang/unittests/ASTMatchers/ASTMatchersTests
[1577/1587] LINK ./bin/lldb-test
[1578/1587] LINK ./bin/lldb-dap
[1579/1587] CXX obj/clang/unittests/Tooling/RecursiveASTVisitorTests/ToolingTests.CallbacksCompoundAssignOperator.o
[1580/1587] LINK ./bin/lldb
[1581/1587] STAMP obj/lldb/test/test.stamp
[1582/1587] LINK obj/clang/unittests/Tooling/ToolingTests
[1583/1587] CXX obj/clang/unittests/AST/ASTTests.ASTImporterTest.o
[1584/1587] LINK obj/clang/unittests/AST/ASTTests
[1585/1587] STAMP obj/clang/unittests/unittests.stamp
[1586/1587] STAMP obj/clang/test/test.stamp
[1587/1587] STAMP obj/default.stamp
INFO:2025-03-19T21:38:17Z:root:analyze
skipping analyze because previous build was not green
INFO:2025-03-19T21:38:17Z:root:testing
INFO:2025-03-19T21:38:17Z:root:test check-clang
ninja: Entering directory `out/gn'
[0/2] ACTION //clang/test:check-clang(//llvm/utils/gn/build/toolchain:unix)
llvm-lit: /usr/local/google/home/thakis/src/llvm-project/llvm/utils/lit/lit/llvm/config.py:520: note: using clang: /usr/local/google/home/thakis/src/llvm-project/out/gn/bin/clang
llvm-lit: /usr/local/google/home/thakis/src/llvm-project/llvm/utils/lit/lit/llvm/subst.py:126: note: Did not find cir-opt in /usr/local/google/home/thakis/src/llvm-project/out/gn/bin:/usr/local/google/home/thakis/src/llvm-project/out/gn/bin
llvm-lit: /usr/local/google/home/thakis/src/llvm-project/llvm/utils/lit/lit/llvm/config.py:520: note: using ld.lld: /usr/local/google/home/thakis/src/llvm-project/out/gn/bin/ld.lld
llvm-lit: /usr/local/google/home/thakis/src/llvm-project/llvm/utils/lit/lit/llvm/config.py:520: note: using lld-link: /usr/local/google/home/thakis/src/llvm-project/out/gn/bin/lld-link
llvm-lit: /usr/local/google/home/thakis/src/llvm-project/llvm/utils/lit/lit/llvm/config.py:520: note: using ld64.lld: /usr/local/google/home/thakis/src/llvm-project/out/gn/bin/ld64.lld
llvm-lit: /usr/local/google/home/thakis/src/llvm-project/llvm/utils/lit/lit/llvm/config.py:520: note: using wasm-ld: /usr/local/google/home/thakis/src/llvm-project/out/gn/bin/wasm-ld
-- Testing: 22200 tests, 64 workers --
Testing:  0.. 10.. 20.. 30.. 40.. 50.. 60.. 70.. 80.. 90..

Testing Time: 128.85s

Total Discovered Tests: 46811
  Skipped          :     4 (0.01%)
  Unsupported      :   144 (0.31%)
  Passed           : 46632 (99.62%)
  Expectedly Failed:    31 (0.07%)
INFO:2025-03-19T21:40:42Z:root:test check-clang-tools
ninja: Entering directory `out/gn'
[0/2] ACTION //clang-tools-extra/test:check-clang-tools(//llvm/utils/gn/build/toolchain:unix)
llvm-lit: /usr/local/google/home/thakis/src/llvm-project/llvm/utils/lit/lit/llvm/config.py:520: note: using clang: /usr/local/google/home/thakis/src/llvm-project/out/gn/bin/clang
-- Testing: 1186 tests, 64 workers --
Testing:  0.. 10.. 20.. 30.. 40.. 50.. 60.. 70.. 80.. 90..

Testing Time: 7.31s

Total Discovered Tests: 1428
  Unsupported      :    2 (0.14%)
  Passed           : 1425 (99.79%)
  Expectedly Failed:    1 (0.07%)
INFO:2025-03-19T21:40:52Z:root:test check-clangd
ninja: Entering directory `out/gn'
[0/2] ACTION //clang-tools-extra/clangd/test:check-clangd(//llvm/utils/gn/build/toolchain:unix)
llvm-lit: /usr/local/google/home/thakis/src/llvm-project/llvm/utils/lit/lit/llvm/config.py:520: note: using clang: /usr/local/google/home/thakis/src/llvm-project/out/gn/bin/clang
-- Testing: 168 tests, 64 workers --
Testing:  0.. 10.. 20.. 30.. 40.. 50.. 60.. 70.. 80.. 90.. 

Testing Time: 5.89s

Total Discovered Tests: 1372
  Unsupported:    6 (0.44%)
  Passed     : 1366 (99.56%)
INFO:2025-03-19T21:40:59Z:root:test check-hwasan
ninja: Entering directory `out/gn'
[0/2] ACTION //compiler-rt/test/hwasan:check-hwasan(//llvm/utils/gn/build/toolchain:unix)
llvm-lit: /usr/local/google/home/thakis/src/llvm-project/compiler-rt/test/lit.common.cfg.py:60: warning: Path reported by clang does not exist: "/usr/local/google/home/thakis/src/llvm-project/out/gn/lib/clang/21/lib/x86_64-unknown-linux-gnu". This path was found by running ['/usr/local/google/home/thakis/src/llvm-project/out/gn/bin/clang', '--target=x86_64-unknown-linux-gnu', '-print-runtime-dir'].
-- Testing: 109 tests, 64 workers --
Testing:  0.. 10.. 20.. 30.. 40.. 50.. 60.. 70.. 80.. 90..

1 warning(s) in tests

Testing Time: 8.49s

Total Discovered Tests: 109
  Unsupported      : 37 (33.94%)
  Passed           : 63 (57.80%)
  Expectedly Failed:  9 (8.26%)
INFO:2025-03-19T21:41:08Z:root:test check-lld
ninja: Entering directory `out/gn'
[0/2] ACTION //lld/test:check-lld(//llvm/utils/gn/build/toolchain:unix)
llvm-lit: /usr/local/google/home/thakis/src/llvm-project/llvm/utils/lit/lit/llvm/config.py:520: note: using ld.lld: /usr/local/google/home/thakis/src/llvm-project/out/gn/bin/ld.lld
llvm-lit: /usr/local/google/home/thakis/src/llvm-project/llvm/utils/lit/lit/llvm/config.py:520: note: using lld-link: /usr/local/google/home/thakis/src/llvm-project/out/gn/bin/lld-link
llvm-lit: /usr/local/google/home/thakis/src/llvm-project/llvm/utils/lit/lit/llvm/config.py:520: note: using ld64.lld: /usr/local/google/home/thakis/src/llvm-project/out/gn/bin/ld64.lld
llvm-lit: /usr/local/google/home/thakis/src/llvm-project/llvm/utils/lit/lit/llvm/config.py:520: note: using wasm-ld: /usr/local/google/home/thakis/src/llvm-project/out/gn/bin/wasm-ld
-- Testing: 3069 tests, 64 workers --
Testing:  0.. 10.. 20.. 30.. 40.. 50.. 60.. 70.. 80.. 90.. 

Testing Time: 13.48s

Total Discovered Tests: 3069
  Unsupported      :   21 (0.68%)
  Passed           : 3047 (99.28%)
  Expectedly Failed:    1 (0.03%)
INFO:2025-03-19T21:41:22Z:root:test check-llvm
ninja: Entering directory `out/gn'
[0/2] ACTION //llvm/test:check-llvm(//llvm/utils/gn/build/toolchain:unix)
llvm-lit: /usr/local/google/home/thakis/src/llvm-project/llvm/utils/lit/lit/llvm/config.py:520: note: using ld.lld: /usr/local/google/home/thakis/src/llvm-project/out/gn/bin/ld.lld
llvm-lit: /usr/local/google/home/thakis/src/llvm-project/llvm/utils/lit/lit/llvm/config.py:520: note: using lld-link: /usr/local/google/home/thakis/src/llvm-project/out/gn/bin/lld-link
llvm-lit: /usr/local/google/home/thakis/src/llvm-project/llvm/utils/lit/lit/llvm/config.py:520: note: using ld64.lld: /usr/local/google/home/thakis/src/llvm-project/out/gn/bin/ld64.lld
llvm-lit: /usr/local/google/home/thakis/src/llvm-project/llvm/utils/lit/lit/llvm/config.py:520: note: using wasm-ld: /usr/local/google/home/thakis/src/llvm-project/out/gn/bin/wasm-ld
-- Testing: 58674 tests, 64 workers --
Testing: 
FAIL: LLVM :: tools/llvm-ml/architecture.asm (1 of 58674)
******************** TEST 'LLVM :: tools/llvm-ml/architecture.asm' FAILED ********************
Exit Code: 2

Command Output (stderr):
--
RUN: at line 1: llvm-ml64 -filetype=s /usr/local/google/home/thakis/src/llvm-project/llvm/test/tools/llvm-ml/architecture.asm /Fo - | /usr/local/google/home/thakis/src/llvm-project/out/gn/bin/FileCheck /usr/local/google/home/thakis/src/llvm-project/llvm/test/tools/llvm-ml/architecture.asm --implicit-check-not=error:
+ llvm-ml64 -filetype=s /usr/local/google/home/thakis/src/llvm-project/llvm/test/tools/llvm-ml/architecture.asm /Fo -
/usr/local/google/home/thakis/src/llvm-project/out/gn/obj/llvm/test/tools/llvm-ml/Output/architecture.asm.script: line 1: llvm-ml64: command not found
+ /usr/local/google/home/thakis/src/llvm-project/out/gn/bin/FileCheck /usr/local/google/home/thakis/src/llvm-project/llvm/test/tools/llvm-ml/architecture.asm --implicit-check-not=error:
FileCheck error: '<stdin>' is empty.
FileCheck command line:  /usr/local/google/home/thakis/src/llvm-project/out/gn/bin/FileCheck /usr/local/google/home/thakis/src/llvm-project/llvm/test/tools/llvm-ml/architecture.asm --implicit-check-not=error:

--

********************
Testing: 
FAIL: LLVM :: tools/llvm-ml/strings_errors.asm (2 of 58674)
******************** TEST 'LLVM :: tools/llvm-ml/strings_errors.asm' FAILED ********************
Exit Code: 1

Command Output (stderr):
--
RUN: at line 1: not llvm-ml64 -filetype=s /usr/local/google/home/thakis/src/llvm-project/llvm/test/tools/llvm-ml/strings_errors.asm /Fo /dev/null 2>&1 | /usr/local/google/home/thakis/src/llvm-project/out/gn/bin/FileCheck /usr/local/google/home/thakis/src/llvm-project/llvm/test/tools/llvm-ml/strings_errors.asm --implicit-check-not=error:
+ not llvm-ml64 -filetype=s /usr/local/google/home/thakis/src/llvm-project/llvm/test/tools/llvm-ml/strings_errors.asm /Fo /dev/null
+ /usr/local/google/home/thakis/src/llvm-project/out/gn/bin/FileCheck /usr/local/google/home/thakis/src/llvm-project/llvm/test/tools/llvm-ml/strings_errors.asm --implicit-check-not=error:
/usr/local/google/home/thakis/src/llvm-project/llvm/test/tools/llvm-ml/strings_errors.asm:9:10: error: CHECK: expected string not found in input
; CHECK: error: literal value out of range
         ^
<stdin>:1:1: note: scanning from here
error: unable to find `llvm-ml64' in PATH: No such file or directory
^
<stdin>:1:55: note: possible intended match here
error: unable to find `llvm-ml64' in PATH: No such file or directory
                                                      ^

Input file: <stdin>
Check file: /usr/local/google/home/thakis/src/llvm-project/llvm/test/tools/llvm-ml/strings_errors.asm

-dump-input=help explains the following input dump.

Input was:
<<<<<<
           1: error: unable to find `llvm-ml64' in PATH: No such file or directory 
check:9'0     X~~~~~~~~~~~~~~~~~~~~~~~~~~~~~~~~~~~~~~~~~~~~~~~~~~~~~~~~~~~~~~~~~~~~ error: no match found
check:9'1                                                           ?               possible intended match
>>>>>>

--

********************
Testing: 
FAIL: LLVM :: tools/llvm-ml/macro.asm (3 of 58674)
******************** TEST 'LLVM :: tools/llvm-ml/macro.asm' FAILED ********************
Exit Code: 2

Command Output (stderr):
--
RUN: at line 1: llvm-ml64 -filetype=s /usr/local/google/home/thakis/src/llvm-project/llvm/test/tools/llvm-ml/macro.asm /Fo - | /usr/local/google/home/thakis/src/llvm-project/out/gn/bin/FileCheck /usr/local/google/home/thakis/src/llvm-project/llvm/test/tools/llvm-ml/macro.asm
+ llvm-ml64 -filetype=s /usr/local/google/home/thakis/src/llvm-project/llvm/test/tools/llvm-ml/macro.asm /Fo -
/usr/local/google/home/thakis/src/llvm-project/out/gn/obj/llvm/test/tools/llvm-ml/Output/macro.asm.script: line 1: llvm-ml64: command not found
+ /usr/local/google/home/thakis/src/llvm-project/out/gn/bin/FileCheck /usr/local/google/home/thakis/src/llvm-project/llvm/test/tools/llvm-ml/macro.asm
FileCheck error: '<stdin>' is empty.
FileCheck command line:  /usr/local/google/home/thakis/src/llvm-project/out/gn/bin/FileCheck /usr/local/google/home/thakis/src/llvm-project/llvm/test/tools/llvm-ml/macro.asm

--

********************
Testing: 
FAIL: LLVM :: tools/llvm-ml/feat00_override.asm (4 of 58674)
******************** TEST 'LLVM :: tools/llvm-ml/feat00_override.asm' FAILED ********************
Exit Code: 2

Command Output (stderr):
--
RUN: at line 1: llvm-ml /usr/local/google/home/thakis/src/llvm-project/llvm/test/tools/llvm-ml/feat00_override.asm /Fo - | /usr/local/google/home/thakis/src/llvm-project/out/gn/bin/llvm-readobj --syms - | /usr/local/google/home/thakis/src/llvm-project/out/gn/bin/FileCheck /usr/local/google/home/thakis/src/llvm-project/llvm/test/tools/llvm-ml/feat00_override.asm
+ llvm-ml /usr/local/google/home/thakis/src/llvm-project/llvm/test/tools/llvm-ml/feat00_override.asm /Fo -
+ /usr/local/google/home/thakis/src/llvm-project/out/gn/bin/llvm-readobj --syms -
+ /usr/local/google/home/thakis/src/llvm-project/out/gn/bin/FileCheck /usr/local/google/home/thakis/src/llvm-project/llvm/test/tools/llvm-ml/feat00_override.asm
RUN: at line 2: llvm-ml64 /usr/local/google/home/thakis/src/llvm-project/llvm/test/tools/llvm-ml/feat00_override.asm /Fo - | /usr/local/google/home/thakis/src/llvm-project/out/gn/bin/llvm-readobj --syms - | /usr/local/google/home/thakis/src/llvm-project/out/gn/bin/FileCheck /usr/local/google/home/thakis/src/llvm-project/llvm/test/tools/llvm-ml/feat00_override.asm
+ llvm-ml64 /usr/local/google/home/thakis/src/llvm-project/llvm/test/tools/llvm-ml/feat00_override.asm /Fo -
/usr/local/google/home/thakis/src/llvm-project/out/gn/obj/llvm/test/tools/llvm-ml/Output/feat00_override.asm.script: line 2: llvm-ml64: command not found
+ /usr/local/google/home/thakis/src/llvm-project/out/gn/bin/llvm-readobj --syms -
+ /usr/local/google/home/thakis/src/llvm-project/out/gn/bin/FileCheck /usr/local/google/home/thakis/src/llvm-project/llvm/test/tools/llvm-ml/feat00_override.asm
/usr/local/google/home/thakis/src/llvm-project/out/gn/bin/llvm-readobj: error: '<stdin>': The file was not recognized as a valid object file
FileCheck error: '<stdin>' is empty.
FileCheck command line:  /usr/local/google/home/thakis/src/llvm-project/out/gn/bin/FileCheck /usr/local/google/home/thakis/src/llvm-project/llvm/test/tools/llvm-ml/feat00_override.asm

--

********************
Testing: 
FAIL: LLVM :: tools/llvm-ml/indirect_branch.asm (5 of 58674)
******************** TEST 'LLVM :: tools/llvm-ml/indirect_branch.asm' FAILED ********************
Exit Code: 2

Command Output (stderr):
--
RUN: at line 1: llvm-ml64 -filetype=s /usr/local/google/home/thakis/src/llvm-project/llvm/test/tools/llvm-ml/indirect_branch.asm /Fo - | /usr/local/google/home/thakis/src/llvm-project/out/gn/bin/FileCheck /usr/local/google/home/thakis/src/llvm-project/llvm/test/tools/llvm-ml/indirect_branch.asm --check-prefixes=CHECK-64,CHECK
+ llvm-ml64 -filetype=s /usr/local/google/home/thakis/src/llvm-project/llvm/test/tools/llvm-ml/indirect_branch.asm /Fo -
/usr/local/google/home/thakis/src/llvm-project/out/gn/obj/llvm/test/tools/llvm-ml/Output/indirect_branch.asm.script: line 1: llvm-ml64: command not found
+ /usr/local/google/home/thakis/src/llvm-project/out/gn/bin/FileCheck /usr/local/google/home/thakis/src/llvm-project/llvm/test/tools/llvm-ml/indirect_branch.asm --check-prefixes=CHECK-64,CHECK
FileCheck error: '<stdin>' is empty.
FileCheck command line:  /usr/local/google/home/thakis/src/llvm-project/out/gn/bin/FileCheck /usr/local/google/home/thakis/src/llvm-project/llvm/test/tools/llvm-ml/indirect_branch.asm --check-prefixes=CHECK-64,CHECK

--

********************
Testing: 
FAIL: LLVM :: tools/llvm-ml/struct.asm (6 of 58674)
******************** TEST 'LLVM :: tools/llvm-ml/struct.asm' FAILED ********************
Exit Code: 2

Command Output (stderr):
--
RUN: at line 1: llvm-ml64 -filetype=s /usr/local/google/home/thakis/src/llvm-project/llvm/test/tools/llvm-ml/struct.asm /Fo - | /usr/local/google/home/thakis/src/llvm-project/out/gn/bin/FileCheck /usr/local/google/home/thakis/src/llvm-project/llvm/test/tools/llvm-ml/struct.asm
+ llvm-ml64 -filetype=s /usr/local/google/home/thakis/src/llvm-project/llvm/test/tools/llvm-ml/struct.asm /Fo -
/usr/local/google/home/thakis/src/llvm-project/out/gn/obj/llvm/test/tools/llvm-ml/Output/struct.asm.script: line 1: llvm-ml64: command not found
+ /usr/local/google/home/thakis/src/llvm-project/out/gn/bin/FileCheck /usr/local/google/home/thakis/src/llvm-project/llvm/test/tools/llvm-ml/struct.asm
FileCheck error: '<stdin>' is empty.
FileCheck command line:  /usr/local/google/home/thakis/src/llvm-project/out/gn/bin/FileCheck /usr/local/google/home/thakis/src/llvm-project/llvm/test/tools/llvm-ml/struct.asm

--

********************
Testing: 
FAIL: LLVM :: tools/llvm-ml/dot_operator.asm (7 of 58674)
******************** TEST 'LLVM :: tools/llvm-ml/dot_operator.asm' FAILED ********************
Exit Code: 2

Command Output (stderr):
--
RUN: at line 1: llvm-ml64 -filetype=s /usr/local/google/home/thakis/src/llvm-project/llvm/test/tools/llvm-ml/dot_operator.asm /Fo - | /usr/local/google/home/thakis/src/llvm-project/out/gn/bin/FileCheck /usr/local/google/home/thakis/src/llvm-project/llvm/test/tools/llvm-ml/dot_operator.asm
+ llvm-ml64 -filetype=s /usr/local/google/home/thakis/src/llvm-project/llvm/test/tools/llvm-ml/dot_operator.asm /Fo -
/usr/local/google/home/thakis/src/llvm-project/out/gn/obj/llvm/test/tools/llvm-ml/Output/dot_operator.asm.script: line 1: llvm-ml64: command not found
+ /usr/local/google/home/thakis/src/llvm-project/out/gn/bin/FileCheck /usr/local/google/home/thakis/src/llvm-project/llvm/test/tools/llvm-ml/dot_operator.asm
FileCheck error: '<stdin>' is empty.
FileCheck command line:  /usr/local/google/home/thakis/src/llvm-project/out/gn/bin/FileCheck /usr/local/google/home/thakis/src/llvm-project/llvm/test/tools/llvm-ml/dot_operator.asm

--

********************
Testing: 
FAIL: LLVM :: tools/llvm-ml/extern.asm (8 of 58674)
******************** TEST 'LLVM :: tools/llvm-ml/extern.asm' FAILED ********************
Exit Code: 2

Command Output (stderr):
--
RUN: at line 1: llvm-ml -filetype=s /usr/local/google/home/thakis/src/llvm-project/llvm/test/tools/llvm-ml/extern.asm /Fo - | /usr/local/google/home/thakis/src/llvm-project/out/gn/bin/FileCheck /usr/local/google/home/thakis/src/llvm-project/llvm/test/tools/llvm-ml/extern.asm --check-prefixes=CHECK,CHECK-32
+ llvm-ml -filetype=s /usr/local/google/home/thakis/src/llvm-project/llvm/test/tools/llvm-ml/extern.asm /Fo -
+ /usr/local/google/home/thakis/src/llvm-project/out/gn/bin/FileCheck /usr/local/google/home/thakis/src/llvm-project/llvm/test/tools/llvm-ml/extern.asm --check-prefixes=CHECK,CHECK-32
RUN: at line 2: llvm-ml64 -filetype=s /usr/local/google/home/thakis/src/llvm-project/llvm/test/tools/llvm-ml/extern.asm /Fo - | /usr/local/google/home/thakis/src/llvm-project/out/gn/bin/FileCheck /usr/local/google/home/thakis/src/llvm-project/llvm/test/tools/llvm-ml/extern.asm --check-prefixes=CHECK,CHECK-64
+ llvm-ml64 -filetype=s /usr/local/google/home/thakis/src/llvm-project/llvm/test/tools/llvm-ml/extern.asm /Fo -
/usr/local/google/home/thakis/src/llvm-project/out/gn/obj/llvm/test/tools/llvm-ml/Output/extern.asm.script: line 2: llvm-ml64: command not found
+ /usr/local/google/home/thakis/src/llvm-project/out/gn/bin/FileCheck /usr/local/google/home/thakis/src/llvm-project/llvm/test/tools/llvm-ml/extern.asm --check-prefixes=CHECK,CHECK-64
FileCheck error: '<stdin>' is empty.
FileCheck command line:  /usr/local/google/home/thakis/src/llvm-project/out/gn/bin/FileCheck /usr/local/google/home/thakis/src/llvm-project/llvm/test/tools/llvm-ml/extern.asm --check-prefixes=CHECK,CHECK-64

--

********************
Testing: 
FAIL: LLVM :: tools/llvm-ml/proc_frame.asm (9 of 58674)
******************** TEST 'LLVM :: tools/llvm-ml/proc_frame.asm' FAILED ********************
Exit Code: 2

Command Output (stderr):
--
RUN: at line 1: llvm-ml64 -filetype=s /usr/local/google/home/thakis/src/llvm-project/llvm/test/tools/llvm-ml/proc_frame.asm /Fo - | /usr/local/google/home/thakis/src/llvm-project/out/gn/bin/FileCheck /usr/local/google/home/thakis/src/llvm-project/llvm/test/tools/llvm-ml/proc_frame.asm
+ llvm-ml64 -filetype=s /usr/local/google/home/thakis/src/llvm-project/llvm/test/tools/llvm-ml/proc_frame.asm /Fo -
/usr/local/google/home/thakis/src/llvm-project/out/gn/obj/llvm/test/tools/llvm-ml/Output/proc_frame.asm.script: line 1: llvm-ml64: command not found
+ /usr/local/google/home/thakis/src/llvm-project/out/gn/bin/FileCheck /usr/local/google/home/thakis/src/llvm-project/llvm/test/tools/llvm-ml/proc_frame.asm
FileCheck error: '<stdin>' is empty.
FileCheck command line:  /usr/local/google/home/thakis/src/llvm-project/out/gn/bin/FileCheck /usr/local/google/home/thakis/src/llvm-project/llvm/test/tools/llvm-ml/proc_frame.asm

--

********************
Testing: 
FAIL: LLVM :: tools/llvm-ml/repeat_directives.asm (10 of 58674)
******************** TEST 'LLVM :: tools/llvm-ml/repeat_directives.asm' FAILED ********************
Exit Code: 2

Command Output (stderr):
--
RUN: at line 1: llvm-ml64 -filetype=s /usr/local/google/home/thakis/src/llvm-project/llvm/test/tools/llvm-ml/repeat_directives.asm /Fo - | /usr/local/google/home/thakis/src/llvm-project/out/gn/bin/FileCheck /usr/local/google/home/thakis/src/llvm-project/llvm/test/tools/llvm-ml/repeat_directives.asm
+ llvm-ml64 -filetype=s /usr/local/google/home/thakis/src/llvm-project/llvm/test/tools/llvm-ml/repeat_directives.asm /Fo -
/usr/local/google/home/thakis/src/llvm-project/out/gn/obj/llvm/test/tools/llvm-ml/Output/repeat_directives.asm.script: line 1: llvm-ml64: command not found
+ /usr/local/google/home/thakis/src/llvm-project/out/gn/bin/FileCheck /usr/local/google/home/thakis/src/llvm-project/llvm/test/tools/llvm-ml/repeat_directives.asm
FileCheck error: '<stdin>' is empty.
FileCheck command line:  /usr/local/google/home/thakis/src/llvm-project/out/gn/bin/FileCheck /usr/local/google/home/thakis/src/llvm-project/llvm/test/tools/llvm-ml/repeat_directives.asm

--

********************
Testing: 
FAIL: LLVM :: tools/llvm-ml/proc.asm (11 of 58674)
******************** TEST 'LLVM :: tools/llvm-ml/proc.asm' FAILED ********************
Exit Code: 2

Command Output (stderr):
--
RUN: at line 1: llvm-ml -filetype=s /usr/local/google/home/thakis/src/llvm-project/llvm/test/tools/llvm-ml/proc.asm /Fo - | /usr/local/google/home/thakis/src/llvm-project/out/gn/bin/FileCheck /usr/local/google/home/thakis/src/llvm-project/llvm/test/tools/llvm-ml/proc.asm
+ llvm-ml -filetype=s /usr/local/google/home/thakis/src/llvm-project/llvm/test/tools/llvm-ml/proc.asm /Fo -
+ /usr/local/google/home/thakis/src/llvm-project/out/gn/bin/FileCheck /usr/local/google/home/thakis/src/llvm-project/llvm/test/tools/llvm-ml/proc.asm
RUN: at line 2: llvm-ml64 -filetype=s /usr/local/google/home/thakis/src/llvm-project/llvm/test/tools/llvm-ml/proc.asm /Fo - | /usr/local/google/home/thakis/src/llvm-project/out/gn/bin/FileCheck /usr/local/google/home/thakis/src/llvm-project/llvm/test/tools/llvm-ml/proc.asm
+ llvm-ml64 -filetype=s /usr/local/google/home/thakis/src/llvm-project/llvm/test/tools/llvm-ml/proc.asm /Fo -
/usr/local/google/home/thakis/src/llvm-project/out/gn/obj/llvm/test/tools/llvm-ml/Output/proc.asm.script: line 2: llvm-ml64: command not found
+ /usr/local/google/home/thakis/src/llvm-project/out/gn/bin/FileCheck /usr/local/google/home/thakis/src/llvm-project/llvm/test/tools/llvm-ml/proc.asm
FileCheck error: '<stdin>' is empty.
FileCheck command line:  /usr/local/google/home/thakis/src/llvm-project/out/gn/bin/FileCheck /usr/local/google/home/thakis/src/llvm-project/llvm/test/tools/llvm-ml/proc.asm

--

********************
Testing: 
FAIL: LLVM :: tools/llvm-ml/nested_proc.asm (12 of 58674)
******************** TEST 'LLVM :: tools/llvm-ml/nested_proc.asm' FAILED ********************
Exit Code: 2

Command Output (stderr):
--
RUN: at line 1: llvm-ml -filetype=s /usr/local/google/home/thakis/src/llvm-project/llvm/test/tools/llvm-ml/nested_proc.asm /Fo - | /usr/local/google/home/thakis/src/llvm-project/out/gn/bin/FileCheck /usr/local/google/home/thakis/src/llvm-project/llvm/test/tools/llvm-ml/nested_proc.asm
+ llvm-ml -filetype=s /usr/local/google/home/thakis/src/llvm-project/llvm/test/tools/llvm-ml/nested_proc.asm /Fo -
+ /usr/local/google/home/thakis/src/llvm-project/out/gn/bin/FileCheck /usr/local/google/home/thakis/src/llvm-project/llvm/test/tools/llvm-ml/nested_proc.asm
RUN: at line 2: llvm-ml64 -filetype=s /usr/local/google/home/thakis/src/llvm-project/llvm/test/tools/llvm-ml/nested_proc.asm /Fo - | /usr/local/google/home/thakis/src/llvm-project/out/gn/bin/FileCheck /usr/local/google/home/thakis/src/llvm-project/llvm/test/tools/llvm-ml/nested_proc.asm
+ llvm-ml64 -filetype=s /usr/local/google/home/thakis/src/llvm-project/llvm/test/tools/llvm-ml/nested_proc.asm /Fo -
+ /usr/local/google/home/thakis/src/llvm-project/out/gn/bin/FileCheck /usr/local/google/home/thakis/src/llvm-project/llvm/test/tools/llvm-ml/nested_proc.asm
/usr/local/google/home/thakis/src/llvm-project/out/gn/obj/llvm/test/tools/llvm-ml/Output/nested_proc.asm.script: line 2: llvm-ml64: command not found
FileCheck error: '<stdin>' is empty.
FileCheck command line:  /usr/local/google/home/thakis/src/llvm-project/out/gn/bin/FileCheck /usr/local/google/home/thakis/src/llvm-project/llvm/test/tools/llvm-ml/nested_proc.asm

--

********************
Testing: 
FAIL: LLVM :: tools/llvm-ml/rip_relative_addressing.asm (13 of 58674)
******************** TEST 'LLVM :: tools/llvm-ml/rip_relative_addressing.asm' FAILED ********************
Exit Code: 2

Command Output (stderr):
--
RUN: at line 1: llvm-ml -filetype=s /usr/local/google/home/thakis/src/llvm-project/llvm/test/tools/llvm-ml/rip_relative_addressing.asm /Fo - | /usr/local/google/home/thakis/src/llvm-project/out/gn/bin/FileCheck /usr/local/google/home/thakis/src/llvm-project/llvm/test/tools/llvm-ml/rip_relative_addressing.asm --check-prefixes=CHECK,CHECK-32
+ llvm-ml -filetype=s /usr/local/google/home/thakis/src/llvm-project/llvm/test/tools/llvm-ml/rip_relative_addressing.asm /Fo -
+ /usr/local/google/home/thakis/src/llvm-project/out/gn/bin/FileCheck /usr/local/google/home/thakis/src/llvm-project/llvm/test/tools/llvm-ml/rip_relative_addressing.asm --check-prefixes=CHECK,CHECK-32
RUN: at line 2: llvm-ml64 -filetype=s /usr/local/google/home/thakis/src/llvm-project/llvm/test/tools/llvm-ml/rip_relative_addressing.asm /Fo - | /usr/local/google/home/thakis/src/llvm-project/out/gn/bin/FileCheck /usr/local/google/home/thakis/src/llvm-project/llvm/test/tools/llvm-ml/rip_relative_addressing.asm --check-prefixes=CHECK,CHECK-64
+ llvm-ml64 -filetype=s /usr/local/google/home/thakis/src/llvm-project/llvm/test/tools/llvm-ml/rip_relative_addressing.asm /Fo -
/usr/local/google/home/thakis/src/llvm-project/out/gn/obj/llvm/test/tools/llvm-ml/Output/rip_relative_addressing.asm.script: line 2: llvm-ml64: command not found
+ /usr/local/google/home/thakis/src/llvm-project/out/gn/bin/FileCheck /usr/local/google/home/thakis/src/llvm-project/llvm/test/tools/llvm-ml/rip_relative_addressing.asm --check-prefixes=CHECK,CHECK-64
FileCheck error: '<stdin>' is empty.
FileCheck command line:  /usr/local/google/home/thakis/src/llvm-project/out/gn/bin/FileCheck /usr/local/google/home/thakis/src/llvm-project/llvm/test/tools/llvm-ml/rip_relative_addressing.asm --check-prefixes=CHECK,CHECK-64

--

********************
Testing: 
FAIL: LLVM :: tools/llvm-ml/architecture_errors.asm (14 of 58674)
******************** TEST 'LLVM :: tools/llvm-ml/architecture_errors.asm' FAILED ********************
Exit Code: 1

Command Output (stderr):
--
RUN: at line 1: not llvm-ml -filetype=s /usr/local/google/home/thakis/src/llvm-project/llvm/test/tools/llvm-ml/architecture_errors.asm /Fo - 2>&1 | /usr/local/google/home/thakis/src/llvm-project/out/gn/bin/FileCheck /usr/local/google/home/thakis/src/llvm-project/llvm/test/tools/llvm-ml/architecture_errors.asm
+ not llvm-ml -filetype=s /usr/local/google/home/thakis/src/llvm-project/llvm/test/tools/llvm-ml/architecture_errors.asm /Fo -
+ /usr/local/google/home/thakis/src/llvm-project/out/gn/bin/FileCheck /usr/local/google/home/thakis/src/llvm-project/llvm/test/tools/llvm-ml/architecture_errors.asm
RUN: at line 2: not llvm-ml -m32 -filetype=s /usr/local/google/home/thakis/src/llvm-project/llvm/test/tools/llvm-ml/architecture_errors.asm /Fo - 2>&1 | /usr/local/google/home/thakis/src/llvm-project/out/gn/bin/FileCheck /usr/local/google/home/thakis/src/llvm-project/llvm/test/tools/llvm-ml/architecture_errors.asm
+ not llvm-ml -m32 -filetype=s /usr/local/google/home/thakis/src/llvm-project/llvm/test/tools/llvm-ml/architecture_errors.asm /Fo -
+ /usr/local/google/home/thakis/src/llvm-project/out/gn/bin/FileCheck /usr/local/google/home/thakis/src/llvm-project/llvm/test/tools/llvm-ml/architecture_errors.asm
RUN: at line 3: not llvm-ml64 -m32 -filetype=s /usr/local/google/home/thakis/src/llvm-project/llvm/test/tools/llvm-ml/architecture_errors.asm /Fo - 2>&1 | /usr/local/google/home/thakis/src/llvm-project/out/gn/bin/FileCheck /usr/local/google/home/thakis/src/llvm-project/llvm/test/tools/llvm-ml/architecture_errors.asm
+ not llvm-ml64 -m32 -filetype=s /usr/local/google/home/thakis/src/llvm-project/llvm/test/tools/llvm-ml/architecture_errors.asm /Fo -
+ /usr/local/google/home/thakis/src/llvm-project/out/gn/bin/FileCheck /usr/local/google/home/thakis/src/llvm-project/llvm/test/tools/llvm-ml/architecture_errors.asm
/usr/local/google/home/thakis/src/llvm-project/llvm/test/tools/llvm-ml/architecture_errors.asm:7:10: error: CHECK: expected string not found in input
; CHECK: :[[# @LINE + 1]]:5: error: register %rax is only available in 64-bit mode
         ^
<stdin>:1:1: note: scanning from here
error: unable to find `llvm-ml64' in PATH: No such file or directory
^
<stdin>:1:1: note: with " @LINE + 1" equal to "8"
error: unable to find `llvm-ml64' in PATH: No such file or directory
^
<stdin>:1:30: note: possible intended match here
error: unable to find `llvm-ml64' in PATH: No such file or directory
                             ^

Input file: <stdin>
Check file: /usr/local/google/home/thakis/src/llvm-project/llvm/test/tools/llvm-ml/architecture_errors.asm

-dump-input=help explains the following input dump.

Input was:
<<<<<<
           1: error: unable to find `llvm-ml64' in PATH: No such file or directory 
check:7'0     X~~~~~~~~~~~~~~~~~~~~~~~~~~~~~~~~~~~~~~~~~~~~~~~~~~~~~~~~~~~~~~~~~~~~ error: no match found
check:7'1                                                                           with " @LINE + 1" equal to "8"
check:7'2                                  ?                                        possible intended match
>>>>>>

--

********************
Testing: 
FAIL: LLVM :: tools/llvm-ml/feat00.asm (15 of 58674)
******************** TEST 'LLVM :: tools/llvm-ml/feat00.asm' FAILED ********************
Exit Code: 2

Command Output (stderr):
--
RUN: at line 1: llvm-ml /usr/local/google/home/thakis/src/llvm-project/llvm/test/tools/llvm-ml/feat00.asm /Fo - | /usr/local/google/home/thakis/src/llvm-project/out/gn/bin/llvm-readobj --syms - | /usr/local/google/home/thakis/src/llvm-project/out/gn/bin/FileCheck /usr/local/google/home/thakis/src/llvm-project/llvm/test/tools/llvm-ml/feat00.asm --check-prefix=CHECK-OBJ --check-prefix=CHECK-OBJ-NOSAFESEH
+ llvm-ml /usr/local/google/home/thakis/src/llvm-project/llvm/test/tools/llvm-ml/feat00.asm /Fo -
+ /usr/local/google/home/thakis/src/llvm-project/out/gn/bin/llvm-readobj --syms -
+ /usr/local/google/home/thakis/src/llvm-project/out/gn/bin/FileCheck /usr/local/google/home/thakis/src/llvm-project/llvm/test/tools/llvm-ml/feat00.asm --check-prefix=CHECK-OBJ --check-prefix=CHECK-OBJ-NOSAFESEH
RUN: at line 2: llvm-ml64 /usr/local/google/home/thakis/src/llvm-project/llvm/test/tools/llvm-ml/feat00.asm /Fo - | /usr/local/google/home/thakis/src/llvm-project/out/gn/bin/llvm-readobj --syms - | /usr/local/google/home/thakis/src/llvm-project/out/gn/bin/FileCheck /usr/local/google/home/thakis/src/llvm-project/llvm/test/tools/llvm-ml/feat00.asm --check-prefix=CHECK-OBJ --check-prefix=CHECK-OBJ-NOSAFESEH
+ llvm-ml64 /usr/local/google/home/thakis/src/llvm-project/llvm/test/tools/llvm-ml/feat00.asm /Fo -
/usr/local/google/home/thakis/src/llvm-project/out/gn/obj/llvm/test/tools/llvm-ml/Output/feat00.asm.script: line 2: llvm-ml64: command not found
+ /usr/local/google/home/thakis/src/llvm-project/out/gn/bin/llvm-readobj --syms -
+ /usr/local/google/home/thakis/src/llvm-project/out/gn/bin/FileCheck /usr/local/google/home/thakis/src/llvm-project/llvm/test/tools/llvm-ml/feat00.asm --check-prefix=CHECK-OBJ --check-prefix=CHECK-OBJ-NOSAFESEH
/usr/local/google/home/thakis/src/llvm-project/out/gn/bin/llvm-readobj: error: '<stdin>': The file was not recognized as a valid object file
FileCheck error: '<stdin>' is empty.
FileCheck command line:  /usr/local/google/home/thakis/src/llvm-project/out/gn/bin/FileCheck /usr/local/google/home/thakis/src/llvm-project/llvm/test/tools/llvm-ml/feat00.asm --check-prefix=CHECK-OBJ --check-prefix=CHECK-OBJ-NOSAFESEH

--

********************
Testing:  0.. 10.. 20.. 30.. 40.. 50.. 60.. 70.. 80.. 90.. 
********************
Failed Tests (15):
  LLVM :: tools/llvm-ml/architecture.asm
  LLVM :: tools/llvm-ml/architecture_errors.asm
  LLVM :: tools/llvm-ml/dot_operator.asm
  LLVM :: tools/llvm-ml/extern.asm
  LLVM :: tools/llvm-ml/feat00.asm
  LLVM :: tools/llvm-ml/feat00_override.asm
  LLVM :: tools/llvm-ml/indirect_branch.asm
  LLVM :: tools/llvm-ml/macro.asm
  LLVM :: tools/llvm-ml/nested_proc.asm
  LLVM :: tools/llvm-ml/proc.asm
  LLVM :: tools/llvm-ml/proc_frame.asm
  LLVM :: tools/llvm-ml/repeat_directives.asm
  LLVM :: tools/llvm-ml/rip_relative_addressing.asm
  LLVM :: tools/llvm-ml/strings_errors.asm
  LLVM :: tools/llvm-ml/struct.asm


Testing Time: 158.97s

Total Discovered Tests: 64607
  Skipped          :    16 (0.02%)
  Unsupported      :  2108 (3.26%)
  Passed           : 62292 (96.42%)
  Expectedly Failed:   176 (0.27%)
  Failed           :    15 (0.02%)
FAILED: gen/llvm/test/run-lit 
python3 bin/llvm-lit -sv ../../llvm/test
ninja: build stopped: subcommand failed.
Command '['ninja', '-C', 'out/gn', 'check-llvm']' returned non-zero exit status 1.