ninja: Entering directory `out/gn' [0/1] Regenerating ninja files [1/4] COPY ../../libcxxabi/include/cxxabi.h include/c++/v1/cxxabi.h [2/4] COPY ../../libcxxabi/include/__cxxabi_config.h include/c++/v1/__cxxabi_config.h [3/4] LINK obj/clang/unittests/offload-arch/OffloadArchTests FAILED: obj/clang/unittests/offload-arch/OffloadArchTests ../../../chrome/src/third_party/llvm-build/Release+Asserts/bin/clang++ -Wl,--color-diagnostics -fuse-ld=lld -o obj/clang/unittests/offload-arch/OffloadArchTests -Wl,--start-group obj/clang/tools/offload-arch/OffloadArchTests.AMDGPUArchByKFD.o obj/clang/unittests/offload-arch/OffloadArchTests.OffloadArchTest.o obj/third-party/unittest/UnitTestMain/UnitTestMain.TestMain.o lib/libclangBasic.a lib/libLLVMSupport.a lib/libLLVMTestingSupport.a lib/libLLVMOption.a lib/libLLVMSupportBlake3.a lib/libLLVMDemangle.a lib/libLLVMTargetParser.a lib/libgtest.a -Wl,--end-group -ldl -lpthread -lz ld.lld: error: undefined symbol: getIntelGPUArchName[abi:cxx11](unsigned int) >>> referenced by OffloadArchTest.cpp >>> obj/clang/unittests/offload-arch/OffloadArchTests.OffloadArchTest.o:(IntelGPUArchName_KnownArchitecturesGetAFriendlyName_Test::TestBody()) >>> referenced by OffloadArchTest.cpp >>> obj/clang/unittests/offload-arch/OffloadArchTests.OffloadArchTest.o:(IntelGPUArchName_KnownArchitecturesGetAFriendlyName_Test::TestBody()) >>> referenced by OffloadArchTest.cpp >>> obj/clang/unittests/offload-arch/OffloadArchTests.OffloadArchTest.o:(IntelGPUArchName_KnownArchitecturesGetAFriendlyName_Test::TestBody()) >>> referenced 8 more times clang++: error: linker command failed with exit code 1 (use -v to see invocation) [4/4] ACTION //libcxx/include:copy_headers(//llvm/utils/gn/build/toolchain:unix) ninja: build stopped: subcommand failed. Command '['ninja', '-C', 'out/gn']' returned non-zero exit status 1.