ninja: Entering directory `out/gn'
[0/1] Regenerating ninja files
[1/273] CXX obj/lldb/source/Host/aix/Host.Host.o
[2/273] AR lib/liblldbHost.a
/Applications/Xcode.app/Contents/Developer/Toolchains/XcodeDefault.xctoolchain/usr/bin/libtool: warning same member name (Host.Host.o) in output file used for input files: obj/lldb/source/Host/common/Host.Host.o and: obj/lldb/source/Host/aix/Host.Host.o (due to use of basename, truncation, blank padding or duplicate input files)
[3/273] CXX obj/clang/lib/Format/Format.UnwrappedLineParser.o
[4/273] AR lib/libclangFormat.a
[5/273] LINK ./bin/clang-format
[6/273] CXX obj/llvm/lib/Target/RISCV/GISel/LLVMRISCVCodeGen.RISCVCallLowering.o
[7/273] CXX obj/llvm/lib/Target/RISCV/GISel/LLVMRISCVCodeGen.RISCVRegisterBankInfo.o
[8/273] CXX obj/llvm/lib/Target/RISCV/GISel/LLVMRISCVCodeGen.RISCVLegalizerInfo.o
[9/273] CXX obj/llvm/lib/Target/RISCV/GISel/LLVMRISCVCodeGen.RISCVO0PreLegalizerCombiner.o
[10/273] CXX obj/llvm/lib/Target/RISCV/GISel/LLVMRISCVCodeGen.RISCVPostLegalizerCombiner.o
[11/273] CXX obj/llvm/lib/Target/RISCV/GISel/LLVMRISCVCodeGen.RISCVPreLegalizerCombiner.o
[12/273] CXX obj/llvm/lib/Target/RISCV/LLVMRISCVCodeGen.RISCVAsmPrinter.o
[13/273] CXX obj/clang/lib/Sema/Sema.Sema.o
[14/273] CXX obj/llvm/lib/Target/RISCV/LLVMRISCVCodeGen.RISCVCallingConv.o
[15/273] AR lib/libclangSema.a
[16/273] LINK ./bin/clang-apply-replacements
[17/273] CXX obj/llvm/lib/Target/RISCV/LLVMRISCVCodeGen.RISCVCodeGenPrepare.o
[18/273] CXX obj/llvm/lib/Target/RISCV/LLVMRISCVCodeGen.RISCVDeadRegisterDefinitions.o
[19/273] CXX obj/llvm/lib/Target/RISCV/LLVMRISCVCodeGen.RISCVExpandAtomicPseudoInsts.o
[20/273] LINK ./bin/clang-include-fixer
[21/273] LINK ./bin/clang-change-namespace
[22/273] LINK ./bin/clang-doc
[23/273] LINK ./bin/find-all-symbols
[24/273] LINK ./bin/clang-reorder-fields
[25/273] CXX obj/llvm/lib/Target/RISCV/LLVMRISCVCodeGen.RISCVExpandPseudoInsts.o
[26/273] LINK ./bin/clang-move
[27/273] LINK ./bin/clang-query
[28/273] LINK obj/clang-tools-extra/unittests/clang-apply-replacements/ClangApplyReplacementsTests
[29/273] LINK ./bin/modularize
[30/273] LINK ./bin/pp-trace
[31/273] CXX obj/llvm/lib/Target/RISCV/LLVMRISCVCodeGen.RISCVFoldMemOffset.o
[32/273] LINK obj/clang-tools-extra/unittests/clang-change-namespace/ClangChangeNamespaceTests
[33/273] LINK obj/clang-tools-extra/unittests/clang-doc/ClangDocTests
[34/273] LINK obj/clang-tools-extra/unittests/clang-move/ClangMoveTests
[35/273] LINK obj/clang-tools-extra/unittests/clang-include-fixer/ClangIncludeFixerTests
[36/273] LINK obj/clang-tools-extra/unittests/clang-query/ClangQueryTests
[37/273] LINK obj/clang-tools-extra/unittests/clang-include-fixer/find-all-symbols/FindAllSymbolsTests
[38/273] LINK ./bin/clang-diff
[39/273] LINK obj/clang-tools-extra/unittests/clang-tidy/ClangTidyTests
[40/273] STAMP obj/clang-tools-extra/unittests/unittests.stamp
[41/273] LINK ./bin/clang-installapi
[42/273] LINK ./bin/clang-extdef-mapping
[43/273] LINK ./bin/clang-refactor
[44/273] LINK ./bin/diagtool
[45/273] LINK ./bin/clang-tidy
[46/273] LINK obj/clang/unittests/Index/IndexTests
[47/273] LINK obj/clang/unittests/Lex/LexTests
[48/273] LINK ./bin/clang-import-test
[49/273] LINK obj/clang/unittests/Frontend/FrontendTests
[50/273] LINK obj/clang/unittests/Rewrite/RewriteTests
[51/273] LINK obj/clang/unittests/Sema/SemaTests
[52/273] LINK obj/clang/unittests/Serialization/SerializationTests
[53/273] LINK obj/clang/unittests/Support/ClangSupportTests
[54/273] LINK obj/clang/unittests/StaticAnalyzer/StaticAnalysisTests
[55/273] LINK obj/clang/unittests/AST/ByteCode/InterpTests
[56/273] LINK obj/clang/unittests/ASTMatchers/Dynamic/DynamicASTMatchersTests
[57/273] LINK obj/clang/unittests/ASTMatchers/ASTMatchersTests
[58/273] LINK obj/clang/unittests/AST/ASTTests
[59/273] LINK obj/clang/unittests/Analysis/ClangAnalysisTests
[60/273] LINK obj/clang/unittests/Analysis/FlowSensitive/ClangAnalysisFlowSensitiveTests
[61/273] LINK obj/clang/unittests/CodeGen/ClangCodeGenTests
[62/273] LINK ./bin/lldb-server
FAILED: bin/lldb-server 
../../chromeclang/bin/clang++ -arch arm64 -isysroot ../../sysroot/MacOSX.sdk -mmacos-version-min=12 -arch arm64 -mmacos-version-min=12 -Wl,--color-diagnostics -fuse-ld=lld -isysroot ../../sysroot/MacOSX.sdk -o ./bin/lldb-server obj/lldb/tools/lldb-server/lldb-server.LLDBServerUtilities.o obj/lldb/tools/lldb-server/lldb-server.SystemInitializerLLGS.o obj/lldb/tools/lldb-server/lldb-server.lldb-gdbserver.o obj/lldb/tools/lldb-server/lldb-server.lldb-platform.o obj/lldb/tools/lldb-server/lldb-server.lldb-server.o lib/liblldbHost.a lib/liblldbInitialization.a lib/liblldbPluginInstructionARM.a lib/liblldbVersion.a lib/libLLVMOption.a lib/libLLVMSupport.a lib/liblldbPluginCPlusPlusLanguage.a lib/liblldbPluginObjectFileMachO.a lib/liblldbPluginPlatformMacOSX.a lib/liblldbUtility.a lib/libLLVMBinaryFormat.a lib/libLLVMSupportBlake3.a lib/libLLVMDemangle.a lib/libLLVMTargetParser.a lib/libLLVMObject.a lib/libLLVMBitReader.a lib/libLLVMBitstreamReader.a lib/libLLVMCore.a lib/libLLVMRemarks.a lib/libLLVMIRReader.a lib/libLLVMAsmParser.a lib/libLLVMMC.a lib/libLLVMDebugInfoCodeView.a lib/libLLVMDebugInfoMSF.a lib/libLLVMMCParser.a lib/libLLVMTextAPI.a lib/liblldbHostMacOSXObjCXX.a lib/liblldbCore.a lib/libclangDriver.a lib/libclangBasic.a lib/libLLVMWindowsDriver.a lib/liblldbValueObject.a lib/libLLVMTelemetry.a lib/liblldbPluginProcessGDBRemote.a lib/liblldbBreakpoint.a lib/liblldbExpression.a lib/liblldbInterpreter.a lib/liblldbInterpreterInterfaces.a lib/liblldbCommands.a lib/liblldbDataFormatters.a lib/libLLVMExecutionEngine.a lib/libLLVMOrcTargetProcess.a lib/libLLVMOrcShared.a lib/libLLVMTarget.a lib/libLLVMAnalysis.a lib/libLLVMProfileData.a lib/libLLVMDebugInfoDWARF.a lib/libLLVMSymbolize.a lib/libLLVMDebugInfoBTF.a lib/libLLVMDebugInfoPDB.a lib/liblldbSymbol.a lib/liblldbTarget.a lib/liblldbPluginProcessUtility.a lib/liblldbPluginDynamicLoaderDarwinKernel.a lib/liblldbPluginObjectContainerMachOFileset.a lib/liblldbPluginPlatformPOSIX.a lib/liblldbPluginPlatformGDB.a lib/liblldbPluginTypeSystemClang.a lib/libclangAST.a lib/libclangLex.a lib/libLLVMFrontendOpenMP.a lib/libLLVMFrontendAtomic.a lib/libLLVMFrontendOffloading.a lib/libLLVMObjectYAML.a lib/libLLVMTransformUtils.a lib/libLLVMScalarOpts.a lib/libLLVMAggressiveInstCombine.a lib/libLLVMInstCombine.a lib/libclangFrontend.a lib/libclangAPINotes.a lib/libclangEdit.a lib/libclangParse.a lib/libclangSema.a lib/libclangAnalysis.a lib/libclangASTMatchers.a lib/libclangSupport.a lib/libclangSerialization.a lib/liblldbPluginExpressionParserClang.a lib/libclangCodeGen.a lib/libLLVMCodeGen.a lib/libLLVMBitWriter.a lib/libLLVMCGData.a lib/libLLVMCodeGenTypes.a lib/libLLVMObjCARCOpts.a lib/libLLVMFrontendDriver.a lib/libLLVMFrontendHLSL.a lib/libLLVMIRPrinter.a lib/libLLVMLTO.a lib/libLLVMExtensions.a lib/libLLVMLinker.a lib/libLLVMPasses.a lib/libLLVMCFGuard.a lib/libLLVMCoroutines.a lib/libLLVMipo.a lib/libLLVMInstrumentation.a lib/libLLVMVectorize.a lib/libLLVMSandboxIR.a lib/libLLVMHipStdPar.a lib/libLLVMCoverage.a lib/libclangRewriteFrontend.a lib/libclangRewrite.a lib/liblldbPluginCPPRuntime.a lib/liblldbPluginObjCRuntime.a lib/libLLVMMCJIT.a lib/libLLVMRuntimeDyld.a lib/liblldbPluginSymbolFileDWARF.a lib/liblldbPluginObjCLanguage.a lib/liblldbPluginClangCommon.a lib/liblldbPluginAppleObjCRuntime.a lib/liblldbPluginSymbolFilePDB.a lib/liblldbPluginSymbolFileNativePDB.a lib/liblldbPluginObjectFilePDB.a lib/liblldbPluginPlatformMacOSXObjCXX.a -lxml2 -ledit -lcurses -lpthread -lz -framework Foundation -framework CoreServices -framework Security
ld64.lld: error: duplicate symbol: lldb_private::Host::FindProcessesImpl(lldb_private::ProcessInstanceInfoMatch const&, std::__1::vector<lldb_private::ProcessInstanceInfo, std::__1::allocator<lldb_private::ProcessInstanceInfo>>&)
>>> defined in lib/liblldbHost.a(Host.Host.o)
>>> defined in lib/liblldbHostMacOSXObjCXX.a(objcxx.Host.o)

ld64.lld: error: duplicate symbol: lldb_private::Host::GetProcessInfo(unsigned long long, lldb_private::ProcessInstanceInfo&)
>>> defined in lib/liblldbHost.a(Host.Host.o)
>>> defined in lib/liblldbHostMacOSXObjCXX.a(objcxx.Host.o)

ld64.lld: error: duplicate symbol: lldb_private::Host::ShellExpandArguments(lldb_private::ProcessLaunchInfo&)
>>> defined in lib/liblldbHost.a(Host.Host.o)
>>> defined in lib/liblldbHostMacOSXObjCXX.a(objcxx.Host.o)
clang: error: linker command failed with exit code 1 (use -v to see invocation)
[63/273] CXX obj/llvm/lib/Target/RISCV/LLVMRISCVCodeGen.RISCVFrameLowering.o
[64/273] CXX obj/llvm/lib/Target/RISCV/LLVMRISCVCodeGen.RISCVGatherScatterLowering.o
[65/273] CXX obj/llvm/lib/Target/RISCV/GISel/LLVMRISCVCodeGen.RISCVInstructionSelector.o
[66/273] CXX obj/llvm/lib/Target/RISCV/LLVMRISCVCodeGen.RISCVIndirectBranchTracking.o
[67/273] CXX obj/llvm/lib/Target/RISCV/LLVMRISCVCodeGen.RISCVInsertReadWriteCSR.o
[68/273] CXX obj/llvm/lib/Target/RISCV/LLVMRISCVCodeGen.RISCVInsertVSETVLI.o
[69/273] CXX obj/clang/unittests/Format/FormatTests.FormatTest.o
[70/273] CXX obj/llvm/lib/Target/RISCV/LLVMRISCVCodeGen.RISCVISelDAGToDAG.o
[71/273] CXX obj/llvm/lib/Target/RISCV/LLVMRISCVCodeGen.RISCVISelLowering.o
ninja: build stopped: subcommand failed.
Command '['ninja', '-C', 'out/gn']' returned non-zero exit status 1.