INFO:2025-03-20T00:40:21Z:root:pulling...
From https://github.com/llvm/llvm-project
 * branch                      main       -> FETCH_HEAD
   c50d39f073f3..fd7be0d2e9e2  main       -> origin/main
Switched to branch 'main'
Your branch is behind 'origin/main' by 2 commits, and can be fast-forwarded.
  (use "git pull" to update your local branch)
HEAD is now at fd7be0d2e9e2 [clang] NFC: Clear some uses of MemberPointerType::getClass (#131965)
INFO:2025-03-20T00:40:26Z:root:syncing...
Deleted branch merge (was c50d39f073f3).
Switched to a new branch 'merge'
branch 'merge' set up to track 'origin/main'.
INFO:2025-03-20T00:40:27Z:root:building
ninja: Entering directory `out/gn'
[1/1719] CXX obj/lldb/source/Plugins/ExpressionParser/Clang/Clang.ASTUtils.o
[2/1719] CXX obj/lldb/source/Plugins/ExpressionParser/Clang/Clang.ClangDeclVendor.o
[3/1719] CXX obj/lldb/source/Plugins/DynamicLoader/MacOSX-DYLD/MacOSX-DYLD.DynamicLoaderMacOS.o
[4/1719] CXX obj/lldb/source/Plugins/DynamicLoader/MacOSX-DYLD/MacOSX-DYLD.DynamicLoaderMacOSXDYLD.o
[5/1719] CXX obj/lldb/source/Plugins/DynamicLoader/MacOSX-DYLD/MacOSX-DYLD.DynamicLoaderDarwin.o
[6/1719] CXX obj/lldb/source/Plugins/ExpressionParser/Clang/Clang.ASTStructExtractor.o
[7/1719] CXX obj/lldb/source/Plugins/ExpressionParser/Clang/Clang.ASTResultSynthesizer.o
[8/1719] CXX obj/lldb/source/Plugins/ExpressionParser/Clang/Clang.ClangASTSource.o
[9/1719] CXX obj/lldb/source/Plugins/ExpressionParser/Clang/Clang.ClangExpressionVariable.o
[10/1719] CXX obj/lldb/source/Plugins/ExpressionParser/Clang/Clang.ClangASTImporter.o
[11/1719] CXX obj/lldb/source/Plugins/ExpressionParser/Clang/Clang.ClangExpressionDeclMap.o
[12/1719] CXX obj/lldb/source/Plugins/ExpressionParser/Clang/Clang.ClangExternalASTSourceCallbacks.o
[13/1719] CXX obj/lldb/source/Plugins/ExpressionParser/Clang/Clang.ClangUtil.o
[14/1719] CXX obj/lldb/source/Plugins/ExpressionParser/Clang/Clang.ClangPersistentVariables.o
[15/1719] CXX obj/lldb/source/Plugins/ExpressionParser/Clang/Clang.ClangFunctionCaller.o
[16/1719] CXX obj/lldb/source/Plugins/ExpressionParser/Clang/Clang.ClangUtilityFunction.o
[17/1719] CXX obj/lldb/source/Plugins/ExpressionParser/Clang/Clang.ClangExpressionParser.o
[18/1719] CXX obj/lldb/source/Plugins/ExpressionParser/Clang/Clang.CxxModuleHandler.o
[19/1719] CXX obj/lldb/source/Plugins/ExpressionParser/Clang/Clang.ClangUserExpression.o
[20/1719] CXX obj/lldb/source/Plugins/ExpressionParser/Clang/Clang.NameSearchContext.o
[21/1719] CXX obj/lldb/source/Plugins/ExpressionParser/Clang/Clang.ClangModulesDeclVendor.o
[22/1719] CXX obj/lldb/source/Plugins/ExpressionParser/Clang/Clang.IRForTarget.o
[23/1719] CXX obj/lldb/source/Plugins/Language/CPlusPlus/CPlusPlus.Coroutines.o
[24/1719] CXX obj/lldb/source/Plugins/Language/CPlusPlus/CPlusPlus.CxxStringTypes.o
[25/1719] CXX obj/lldb/source/Plugins/Language/CPlusPlus/CPlusPlus.BlockPointer.o
[26/1719] CXX obj/lldb/source/Plugins/Language/CPlusPlus/CPlusPlus.GenericOptional.o
[27/1719] CXX obj/lldb/source/Plugins/Language/CPlusPlus/CPlusPlus.GenericBitset.o
[28/1719] CXX obj/lldb/source/Plugins/Language/CPlusPlus/CPlusPlus.LibCxxList.o
[29/1719] CXX obj/lldb/source/Plugins/Language/CPlusPlus/CPlusPlus.LibCxx.o
[30/1719] CXX obj/lldb/source/Plugins/Language/CPlusPlus/CPlusPlus.LibCxxMap.o
[31/1719] CXX obj/lldb/source/Plugins/Language/CPlusPlus/CPlusPlus.LibCxxUnorderedMap.o
[32/1719] CXX obj/lldb/source/Plugins/Language/CPlusPlus/CPlusPlus.LibStdcpp.o
[33/1719] CXX obj/lldb/source/Plugins/Language/ObjC/ObjC.CF.o
[34/1719] CXX obj/lldb/source/Plugins/Language/ObjC/ObjC.Cocoa.o
[35/1719] CXX obj/lldb/source/Plugins/Language/ObjC/ObjC.NSArray.o
[36/1719] CXX obj/lldb/source/Plugins/Language/ObjC/ObjC.NSError.o
[37/1719] CXX obj/lldb/source/Plugins/Language/ObjC/ObjC.NSException.o
[38/1719] CXX obj/lldb/source/Plugins/Language/ObjC/ObjC.NSDictionary.o
[39/1719] CXX obj/lldb/source/Plugins/SymbolFile/PDB/PDB.SymbolFilePDB.o
[40/1719] CXX obj/lldb/source/Plugins/Language/ObjC/ObjC.NSIndexPath.o
[41/1719] CXX obj/lldb/source/Commands/Commands.CommandObjectTarget.o
[42/1719] AR lib/liblldbCommands.a
[43/1719] CXX obj/lldb/source/Plugins/Language/ObjC/ObjC.NSSet.o
[44/1719] CXX obj/lldb/source/Plugins/Language/ObjC/ObjC.ObjCLanguage.o
[45/1719] CXX obj/lldb/source/Plugins/LanguageRuntime/CPlusPlus/ItaniumABI/ItaniumABI.ItaniumABILanguageRuntime.o
[46/1719] CXX obj/lldb/source/Plugins/TypeSystem/Clang/Clang.TypeSystemClang.o
[47/1719] CXX obj/lldb/source/Plugins/LanguageRuntime/ObjC/AppleObjCRuntime/AppleObjCRuntime.AppleObjCDeclVendor.o
[48/1719] CXX obj/lldb/source/Plugins/LanguageRuntime/ObjC/ObjC.ObjCLanguageRuntime.o
[49/1719] AR lib/liblldbPluginObjCRuntime.a
[50/1719] CXX obj/lldb/source/Plugins/LanguageRuntime/ObjC/AppleObjCRuntime/AppleObjCRuntime.AppleObjCRuntime.o
[51/1719] CXX obj/lldb/source/Plugins/LanguageRuntime/ObjC/AppleObjCRuntime/AppleObjCRuntime.AppleObjCRuntimeV1.o
[52/1719] CXX obj/lldb/source/Plugins/LanguageRuntime/ObjC/AppleObjCRuntime/AppleObjCRuntime.AppleObjCTrampolineHandler.o
[53/1719] CXX obj/lldb/source/Plugins/LanguageRuntime/ObjC/AppleObjCRuntime/AppleObjCRuntime.AppleObjCTypeEncodingParser.o
[54/1719] CXX obj/lldb/source/Plugins/LanguageRuntime/ObjC/AppleObjCRuntime/AppleObjCRuntime.AppleObjCRuntimeV2.o
[55/1719] CXX obj/lldb/source/Plugins/Platform/Linux/Linux.PlatformLinux.o
[56/1719] CXX obj/lldb/source/Plugins/Platform/POSIX/POSIX.PlatformPOSIX.o
[57/1719] CXX obj/lldb/source/Plugins/Platform/Windows/Windows.PlatformWindows.o
[58/1719] AR lib/liblldbPluginPlatformWindows.a
[59/1719] CXX obj/lldb/source/Plugins/SymbolFile/NativePDB/NativePDB.PdbAstBuilder.o
[60/1719] CXX obj/clang-tools-extra/clang-tidy/android/android.CloexecAcceptCheck.o
[61/1719] CXX obj/clang-tools-extra/clang-tidy/android/android.CloexecAccept4Check.o
[62/1719] CXX obj/lldb/source/Plugins/SymbolFile/DWARF/DWARF.DWARFASTParserClang.o
[63/1719] CXX obj/clang-tools-extra/clang-tidy/android/android.AndroidTidyModule.o
[64/1719] CXX obj/lldb/source/Plugins/SymbolFile/NativePDB/NativePDB.SymbolFileNativePDB.o
[65/1719] CXX obj/lldb/source/Plugins/SymbolFile/PDB/PDB.PDBASTParser.o
[66/1719] CXX obj/lldb/source/Plugins/SymbolFile/NativePDB/NativePDB.UdtRecordCompleter.o
[67/1719] CXX obj/lldb/tools/lldb-test/lldb-test.lldb-test.o
[68/1719] CXX obj/lldb/source/Plugins/SymbolFile/DWARF/DWARF.SymbolFileDWARF.o
[69/1719] CXX obj/clang-tools-extra/clang-tidy/android/android.CloexecCreatCheck.o
[70/1719] CXX obj/clang-tools-extra/clang-tidy/android/android.CloexecCheck.o
[71/1719] CXX obj/clang-tools-extra/clang-tidy/android/android.CloexecDupCheck.o
[72/1719] CXX obj/clang-tools-extra/clang-tidy/android/android.CloexecEpollCreateCheck.o
[73/1719] CXX obj/clang-tools-extra/clang-tidy/android/android.CloexecEpollCreate1Check.o
[74/1719] CXX obj/clang-tools-extra/clang-tidy/android/android.CloexecFopenCheck.o
[75/1719] CXX obj/clang-tools-extra/clang-tidy/android/android.CloexecInotifyInit1Check.o
[76/1719] CXX obj/clang-tools-extra/clang-tidy/android/android.CloexecInotifyInitCheck.o
[77/1719] CXX obj/clang-tools-extra/clang-tidy/android/android.CloexecMemfdCreateCheck.o
[78/1719] CXX obj/clang-tools-extra/clang-tidy/android/android.CloexecOpenCheck.o
[79/1719] CXX obj/clang-tools-extra/clang-tidy/android/android.CloexecPipeCheck.o
[80/1719] CXX obj/clang-tools-extra/clang-tidy/android/android.CloexecSocketCheck.o
[81/1719] CXX obj/clang-tools-extra/clang-tidy/android/android.CloexecPipe2Check.o
[82/1719] CXX obj/clang-tools-extra/clang-tidy/android/android.ComparisonInTempFailureRetryCheck.o
[83/1719] CXX obj/clang-tools-extra/clang-tidy/boost/boost.BoostTidyModule.o
[84/1719] CXX obj/clang-tools-extra/clang-tidy/boost/boost.UseRangesCheck.o
[85/1719] CXX obj/clang-tools-extra/clang-tidy/bugprone/bugprone.ArgumentCommentCheck.o
[86/1719] CXX obj/clang-tools-extra/clang-tidy/boost/boost.UseToStringCheck.o
[87/1719] CXX obj/clang-tools-extra/clang-tidy/bugprone/bugprone.AssertSideEffectCheck.o
[88/1719] CXX obj/clang-tools-extra/clang-tidy/bugprone/bugprone.BitwisePointerCastCheck.o
[89/1719] CXX obj/clang-tools-extra/clang-tidy/bugprone/bugprone.BadSignalToKillThreadCheck.o
[90/1719] CXX obj/clang-tools-extra/clang-tidy/bugprone/bugprone.BoolPointerImplicitConversionCheck.o
[91/1719] CXX obj/clang-tools-extra/clang-tidy/bugprone/bugprone.CastingThroughVoidCheck.o
[92/1719] CXX obj/clang-tools-extra/clang-tidy/bugprone/bugprone.CapturingThisInMemberVariableCheck.o
[93/1719] CXX obj/clang-tools-extra/clang-tidy/bugprone/bugprone.ChainedComparisonCheck.o
[94/1719] CXX obj/clang-tools-extra/clang-tidy/bugprone/bugprone.ComparePointerToMemberVirtualFunctionCheck.o
[95/1719] CXX obj/clang-tools-extra/clang-tidy/bugprone/bugprone.CopyConstructorInitCheck.o
[96/1719] CXX obj/clang-tools-extra/clang-tidy/bugprone/bugprone.BranchCloneCheck.o
[97/1719] CXX obj/clang-tools-extra/clang-tidy/bugprone/bugprone.CrtpConstructorAccessibilityCheck.o
[98/1719] CXX obj/clang-tools-extra/clang-tidy/bugprone/bugprone.AssignmentInIfConditionCheck.o
[99/1719] CXX obj/clang-tools-extra/clang-tidy/bugprone/bugprone.DanglingHandleCheck.o
[100/1719] CXX obj/clang-tools-extra/clang-tidy/bugprone/bugprone.DynamicStaticInitializersCheck.o
[101/1719] CXX obj/clang-tools-extra/clang-tidy/bugprone/bugprone.EmptyCatchCheck.o
[102/1719] CXX obj/clang-tools-extra/clang-tidy/bugprone/bugprone.ExceptionEscapeCheck.o
[103/1719] CXX obj/clang-tools-extra/clang-tidy/bugprone/bugprone.BugproneTidyModule.o
[104/1719] CXX obj/clang-tools-extra/clang-tidy/bugprone/bugprone.FoldInitTypeCheck.o
[105/1719] CXX obj/clang-tools-extra/clang-tidy/bugprone/bugprone.ForwardDeclarationNamespaceCheck.o
[106/1719] CXX obj/clang-tools-extra/clang-tidy/bugprone/bugprone.ForwardingReferenceOverloadCheck.o
[107/1719] CXX obj/clang-tools-extra/clang-tidy/bugprone/bugprone.InaccurateEraseCheck.o
[108/1719] CXX obj/clang-tools-extra/clang-tidy/bugprone/bugprone.IncDecInConditionsCheck.o
[109/1719] CXX obj/clang-tools-extra/clang-tidy/bugprone/bugprone.ImplicitWideningOfMultiplicationResultCheck.o
[110/1719] CXX obj/clang-tools-extra/clang-tidy/bugprone/bugprone.IncorrectEnableIfCheck.o
[111/1719] CXX obj/clang-tools-extra/clang-tidy/bugprone/bugprone.IncorrectEnableSharedFromThisCheck.o
[112/1719] CXX obj/clang-tools-extra/clang-tidy/bugprone/bugprone.IncorrectRoundingsCheck.o
[113/1719] CXX obj/clang-tools-extra/clang-tidy/bugprone/bugprone.EasilySwappableParametersCheck.o
[114/1719] CXX obj/clang-tools-extra/clang-tidy/bugprone/bugprone.IntegerDivisionCheck.o
[115/1719] CXX obj/clang-tools-extra/clang-tidy/bugprone/bugprone.InfiniteLoopCheck.o
[116/1719] CXX obj/clang-tools-extra/clang-tidy/bugprone/bugprone.LambdaFunctionNameCheck.o
[117/1719] CXX obj/clang-tools-extra/clang-tidy/bugprone/bugprone.MacroRepeatedSideEffectsCheck.o
[118/1719] CXX obj/clang-tools-extra/clang-tidy/bugprone/bugprone.MisplacedPointerArithmeticInAllocCheck.o
[119/1719] CXX obj/clang-tools-extra/clang-tidy/bugprone/bugprone.MisplacedOperatorInStrlenInAllocCheck.o
[120/1719] CXX obj/clang-tools-extra/clang-tidy/bugprone/bugprone.MacroParenthesesCheck.o
[121/1719] CXX obj/clang-tools-extra/clang-tidy/bugprone/bugprone.MisplacedWideningCastCheck.o
[122/1719] CXX obj/clang-tools-extra/clang-tidy/bugprone/bugprone.MoveForwardingReferenceCheck.o
[123/1719] CXX obj/clang-tools-extra/clang-tidy/bugprone/bugprone.MultiLevelImplicitPointerConversionCheck.o
[124/1719] CXX obj/clang-tools-extra/clang-tidy/bugprone/bugprone.MultipleNewInOneExpressionCheck.o
[125/1719] CXX obj/clang-tools-extra/clang-tidy/bugprone/bugprone.MultipleStatementMacroCheck.o
[126/1719] CXX obj/clang-tools-extra/clang-tidy/bugprone/bugprone.NoEscapeCheck.o
[127/1719] CXX obj/clang-tools-extra/clang-tidy/bugprone/bugprone.NarrowingConversionsCheck.o
[128/1719] CXX obj/clang-tools-extra/clang-tidy/bugprone/bugprone.NonZeroEnumToBoolConversionCheck.o
[129/1719] CXX obj/clang-tools-extra/clang-tidy/bugprone/bugprone.NondeterministicPointerIterationOrderCheck.o
[130/1719] CXX obj/clang-tools-extra/clang-tidy/bugprone/bugprone.OptionalValueConversionCheck.o
[131/1719] CXX obj/clang-tools-extra/clang-tidy/bugprone/bugprone.ParentVirtualCallCheck.o
[132/1719] CXX obj/clang-tools-extra/clang-tidy/bugprone/bugprone.PointerArithmeticOnPolymorphicObjectCheck.o
[133/1719] CXX obj/clang-tools-extra/clang-tidy/bugprone/bugprone.NotNullTerminatedResultCheck.o
[134/1719] CXX obj/clang-tools-extra/clang-tidy/bugprone/bugprone.RedundantBranchConditionCheck.o
[135/1719] CXX obj/clang-tools-extra/clang-tidy/bugprone/bugprone.PosixReturnCheck.o
[136/1719] CXX obj/clang-tools-extra/clang-tidy/bugprone/bugprone.ReservedIdentifierCheck.o
[137/1719] CXX obj/clang-tools-extra/clang-tidy/bugprone/bugprone.ReturnConstRefFromParameterCheck.o
[138/1719] CXX obj/clang-tools-extra/clang-tidy/bugprone/bugprone.SharedPtrArrayMismatchCheck.o
[139/1719] CXX obj/clang-tools-extra/clang-tidy/bugprone/bugprone.SignalHandlerCheck.o
[140/1719] CXX obj/clang-tools-extra/clang-tidy/bugprone/bugprone.SizeofContainerCheck.o
[141/1719] CXX obj/clang-tools-extra/clang-tidy/bugprone/bugprone.SignedCharMisuseCheck.o
[142/1719] CXX obj/clang-tools-extra/clang-tidy/bugprone/bugprone.SizeofExpressionCheck.o
[143/1719] CXX obj/clang-tools-extra/clang-tidy/bugprone/bugprone.StandaloneEmptyCheck.o
[144/1719] CXX obj/clang-tools-extra/clang-tidy/bugprone/bugprone.SmartPtrArrayMismatchCheck.o
[145/1719] CXX obj/clang-tools-extra/clang-tidy/bugprone/bugprone.SpuriouslyWakeUpFunctionsCheck.o
[146/1719] CXX obj/clang-tools-extra/clang-tidy/bugprone/bugprone.StringLiteralWithEmbeddedNulCheck.o
[147/1719] CXX obj/clang-tools-extra/clang-tidy/bugprone/bugprone.StringIntegerAssignmentCheck.o
[148/1719] CXX obj/clang-tools-extra/clang-tidy/bugprone/bugprone.StringConstructorCheck.o
[149/1719] CXX obj/clang-tools-extra/clang-tidy/bugprone/bugprone.SuspiciousEnumUsageCheck.o
[150/1719] CXX obj/clang-tools-extra/clang-tidy/bugprone/bugprone.SuspiciousIncludeCheck.o
[151/1719] CXX obj/clang-tools-extra/clang-tidy/bugprone/bugprone.StringviewNullptrCheck.o
[152/1719] CXX obj/clang-tools-extra/clang-tidy/bugprone/bugprone.SuspiciousMemoryComparisonCheck.o
[153/1719] CXX obj/clang-tools-extra/clang-tidy/bugprone/bugprone.SuspiciousMemsetUsageCheck.o
[154/1719] CXX obj/clang-tools-extra/clang-tidy/bugprone/bugprone.SuspiciousMissingCommaCheck.o
[155/1719] CXX obj/clang-tools-extra/clang-tidy/bugprone/bugprone.SuspiciousSemicolonCheck.o
[156/1719] CXX obj/clang-tools-extra/clang-tidy/bugprone/bugprone.SuspiciousReallocUsageCheck.o
[157/1719] CXX obj/clang-tools-extra/clang-tidy/bugprone/bugprone.SuspiciousStringviewDataUsageCheck.o
[158/1719] CXX obj/clang-tools-extra/clang-tidy/bugprone/bugprone.SuspiciousStringCompareCheck.o
[159/1719] CXX obj/clang-tools-extra/clang-tidy/bugprone/bugprone.SwappedArgumentsCheck.o
[160/1719] CXX obj/clang-tools-extra/clang-tidy/bugprone/bugprone.SwitchMissingDefaultCaseCheck.o
[161/1719] CXX obj/clang-tools-extra/clang-tidy/bugprone/bugprone.TerminatingContinueCheck.o
[162/1719] CXX obj/clang-tools-extra/clang-tidy/bugprone/bugprone.TaggedUnionMemberCountCheck.o
[163/1719] CXX obj/clang-tools-extra/clang-tidy/bugprone/bugprone.ThrowKeywordMissingCheck.o
[164/1719] CXX obj/clang-tools-extra/clang-tidy/bugprone/bugprone.TooSmallLoopVariableCheck.o
[165/1719] CXX obj/clang-tools-extra/clang-tidy/bugprone/bugprone.UndefinedMemoryManipulationCheck.o
[166/1719] CXX obj/clang-tools-extra/clang-tidy/bugprone/bugprone.UndelegatedConstructorCheck.o
[167/1719] CXX obj/clang-tools-extra/clang-tidy/bugprone/bugprone.UncheckedOptionalAccessCheck.o
[168/1719] CXX obj/clang-tools-extra/clang-tidy/bugprone/bugprone.UnhandledExceptionAtNewCheck.o
[169/1719] CXX obj/clang-tools-extra/clang-tidy/bugprone/bugprone.UnintendedCharOstreamOutputCheck.o
[170/1719] CXX obj/clang-tools-extra/clang-tidy/bugprone/bugprone.UnhandledSelfAssignmentCheck.o
[171/1719] CXX obj/clang-tools-extra/clang-tidy/bugprone/bugprone.UniquePtrArrayMismatchCheck.o
[172/1719] CXX obj/clang-tools-extra/clang-tidy/bugprone/bugprone.UnusedLocalNonTrivialVariableCheck.o
[173/1719] CXX obj/clang-tools-extra/clang-tidy/bugprone/bugprone.UnsafeFunctionsCheck.o
[174/1719] CXX obj/clang-tools-extra/clang-tidy/bugprone/bugprone.UnusedRaiiCheck.o
[175/1719] CXX obj/clang-tools-extra/clang-tidy/bugprone/bugprone.UnusedReturnValueCheck.o
[176/1719] CXX obj/clang-tools-extra/clang-tidy/bugprone/bugprone.VirtualNearMissCheck.o
[177/1719] CXX obj/clang-tools-extra/clang-tidy/cert/cert.CommandProcessorCheck.o
[178/1719] CXX obj/clang-tools-extra/clang-tidy/bugprone/bugprone.UseAfterMoveCheck.o
[179/1719] CXX obj/clang-tools-extra/clang-tidy/cert/cert.DefaultOperatorNewAlignmentCheck.o
[180/1719] CXX obj/clang-tools-extra/clang-tidy/cert/cert.FloatLoopCounter.o
[181/1719] CXX obj/clang-tools-extra/clang-tidy/cert/cert.DontModifyStdNamespaceCheck.o
[182/1719] CXX obj/clang-tools-extra/clang-tidy/cert/cert.LimitedRandomnessCheck.o
[183/1719] CXX obj/clang-tools-extra/clang-tidy/cert/cert.CERTTidyModule.o
[184/1719] CXX obj/clang-tools-extra/clang-tidy/cert/cert.MutatingCopyCheck.o
[185/1719] CXX obj/clang-tools-extra/clang-tidy/cert/cert.ProperlySeededRandomGeneratorCheck.o
[186/1719] CXX obj/clang-tools-extra/clang-tidy/cert/cert.NonTrivialTypesLibcMemoryCallsCheck.o
[187/1719] CXX obj/clang-tools-extra/clang-tidy/cert/cert.StrToNumCheck.o
[188/1719] CXX obj/clang-tools-extra/clang-tidy/cert/cert.StaticObjectExceptionCheck.o
[189/1719] CXX obj/clang-tools-extra/clang-tidy/cert/cert.SetLongJmpCheck.o
[190/1719] CXX obj/clang-tools-extra/clang-tidy/cert/cert.ThrownExceptionTypeCheck.o
[191/1719] CXX obj/clang-tools-extra/clang-tidy/cert/cert.VariadicFunctionDefCheck.o
[192/1719] CXX obj/clang-tools-extra/clang-tidy/concurrency/concurrency.ConcurrencyTidyModule.o
[193/1719] CXX obj/clang-tools-extra/clang-tidy/concurrency/concurrency.MtUnsafeCheck.o
[194/1719] CXX obj/clang-tools-extra/clang-tidy/concurrency/concurrency.ThreadCanceltypeAsynchronousCheck.o
[195/1719] CXX obj/clang-tools-extra/clang-tidy/modernize/modernize.MakeSharedCheck.o
[196/1719] CXX obj/clang-tools-extra/clang-tidy/cppcoreguidelines/cppcoreguidelines.AvoidCapturingLambdaCoroutinesCheck.o
[197/1719] CXX obj/clang-tools-extra/clang-tidy/cppcoreguidelines/cppcoreguidelines.AvoidConstOrRefDataMembersCheck.o
[198/1719] CXX obj/clang-tools-extra/clang-tidy/cppcoreguidelines/cppcoreguidelines.AvoidDoWhileCheck.o
[199/1719] CXX obj/clang-tools-extra/clang-tidy/modernize/modernize.MacroToEnumCheck.o
[200/1719] CXX obj/clang-tools-extra/clang-tidy/cppcoreguidelines/cppcoreguidelines.AvoidGotoCheck.o
[201/1719] CXX obj/clang-tools-extra/clang-tidy/cppcoreguidelines/cppcoreguidelines.InitVariablesCheck.o
[202/1719] CXX obj/clang-tools-extra/clang-tidy/modernize/modernize.MakeSmartPtrCheck.o
[203/1719] CXX obj/clang-tools-extra/clang-tidy/cppcoreguidelines/cppcoreguidelines.MacroUsageCheck.o
[204/1719] CXX obj/clang-tools-extra/clang-tidy/cppcoreguidelines/cppcoreguidelines.AvoidNonConstGlobalVariablesCheck.o
[205/1719] CXX obj/clang-tools-extra/clang-tidy/cppcoreguidelines/cppcoreguidelines.AvoidReferenceCoroutineParametersCheck.o
[206/1719] CXX obj/clang-tools-extra/clang-tidy/cppcoreguidelines/cppcoreguidelines.NoMallocCheck.o
[207/1719] CXX obj/clang-tools-extra/clang-tidy/cppcoreguidelines/cppcoreguidelines.InterfacesGlobalInitCheck.o
[208/1719] CXX obj/clang-tools-extra/clang-tidy/cppcoreguidelines/cppcoreguidelines.MisleadingCaptureDefaultByValueCheck.o
[209/1719] CXX obj/clang-tools-extra/clang-tidy/cppcoreguidelines/cppcoreguidelines.MissingStdForwardCheck.o
[210/1719] CXX obj/clang-tools-extra/clang-tidy/cppcoreguidelines/cppcoreguidelines.CppCoreGuidelinesTidyModule.o
[211/1719] CXX obj/clang-tools-extra/clang-tidy/cppcoreguidelines/cppcoreguidelines.ProTypeConstCastCheck.o
[212/1719] CXX obj/clang-tools-extra/clang-tidy/cppcoreguidelines/cppcoreguidelines.NoSuspendWithLockCheck.o
[213/1719] CXX obj/clang-tools-extra/clang-tidy/cppcoreguidelines/cppcoreguidelines.ProTypeCstyleCastCheck.o
[214/1719] CXX obj/clang-tools-extra/clang-tidy/cppcoreguidelines/cppcoreguidelines.OwningMemoryCheck.o
[215/1719] CXX obj/clang-tools-extra/clang-tidy/cppcoreguidelines/cppcoreguidelines.PreferMemberInitializerCheck.o
[216/1719] CXX obj/clang-tools-extra/clang-tidy/cppcoreguidelines/cppcoreguidelines.ProBoundsArrayToPointerDecayCheck.o
[217/1719] CXX obj/clang-tools-extra/clang-tidy/cppcoreguidelines/cppcoreguidelines.ProBoundsPointerArithmeticCheck.o
[218/1719] CXX obj/clang-tools-extra/clang-tidy/cppcoreguidelines/cppcoreguidelines.ProBoundsConstantArrayIndexCheck.o
[219/1719] CXX obj/clang-tools-extra/clang-tidy/cppcoreguidelines/cppcoreguidelines.ProTypeUnionAccessCheck.o
[220/1719] CXX obj/clang-tools-extra/clang-tidy/cppcoreguidelines/cppcoreguidelines.ProTypeReinterpretCastCheck.o
[221/1719] CXX obj/clang-tools-extra/clang-tidy/cppcoreguidelines/cppcoreguidelines.ProTypeMemberInitCheck.o
[222/1719] CXX obj/clang-tools-extra/clang-tidy/cppcoreguidelines/cppcoreguidelines.ProTypeStaticCastDowncastCheck.o
[223/1719] CXX obj/clang-tools-extra/clang-tidy/cppcoreguidelines/cppcoreguidelines.ProTypeVarargCheck.o
[224/1719] CXX obj/clang-tools-extra/clang-tidy/darwin/darwin.DarwinTidyModule.o
[225/1719] CXX obj/clang-tools-extra/clang-tidy/cppcoreguidelines/cppcoreguidelines.SlicingCheck.o
[226/1719] CXX obj/clang-tools-extra/clang-tidy/fuchsia/fuchsia.DefaultArgumentsDeclarationsCheck.o
[227/1719] CXX obj/clang-tools-extra/clang-tidy/cppcoreguidelines/cppcoreguidelines.RvalueReferenceParamNotMovedCheck.o
[228/1719] CXX obj/clang-tools-extra/clang-tidy/cppcoreguidelines/cppcoreguidelines.SpecialMemberFunctionsCheck.o
[229/1719] CXX obj/clang-tools-extra/clang-tidy/google/google.UnnamedNamespaceInHeaderCheck.o
[230/1719] CXX obj/clang-tools-extra/clang-tidy/cppcoreguidelines/cppcoreguidelines.VirtualClassDestructorCheck.o
[231/1719] CXX obj/clang-tools-extra/clang-tidy/fuchsia/fuchsia.DefaultArgumentsCallsCheck.o
[232/1719] CXX obj/clang-tools-extra/clang-tidy/fuchsia/fuchsia.MultipleInheritanceCheck.o
[233/1719] CXX obj/clang-tools-extra/clang-tidy/fuchsia/fuchsia.FuchsiaTidyModule.o
[234/1719] CXX obj/clang-tools-extra/clang-tidy/darwin/darwin.AvoidSpinlockCheck.o
[235/1719] CXX obj/clang-tools-extra/clang-tidy/darwin/darwin.DispatchOnceNonstaticCheck.o
[236/1719] CXX obj/clang-tools-extra/clang-tidy/fuchsia/fuchsia.OverloadedOperatorCheck.o
[237/1719] CXX obj/clang-tools-extra/clang-tidy/google/google.TodoCommentCheck.o
[238/1719] CXX obj/clang-tools-extra/clang-tidy/fuchsia/fuchsia.StaticallyConstructedObjectsCheck.o
[239/1719] CXX obj/clang-tools-extra/clang-tidy/fuchsia/fuchsia.TrailingReturnCheck.o
[240/1719] CXX obj/clang-tools-extra/clang-tidy/fuchsia/fuchsia.VirtualInheritanceCheck.o
[241/1719] CXX obj/clang-tools-extra/clang-tidy/google/google.OverloadedUnaryAndCheck.o
[242/1719] CXX obj/clang-tools-extra/clang-tidy/google/google.IntegerTypesCheck.o
[243/1719] CXX obj/clang-tools-extra/clang-tidy/google/google.GlobalVariableDeclarationCheck.o
[244/1719] CXX obj/clang-tools-extra/clang-tidy/google/google.GoogleTidyModule.o
[245/1719] CXX obj/clang-tools-extra/clang-tidy/google/google.GlobalNamesInHeadersCheck.o
[246/1719] CXX obj/clang-tools-extra/clang-tidy/google/google.FunctionNamingCheck.o
[247/1719] CXX obj/clang-tools-extra/clang-tidy/google/google.ExplicitMakePairCheck.o
[248/1719] CXX obj/clang-tools-extra/clang-tidy/google/google.ExplicitConstructorCheck.o
[249/1719] CXX obj/clang-tools-extra/clang-tidy/google/google.DefaultArgumentsCheck.o
[250/1719] CXX obj/clang-tools-extra/clang-tidy/google/google.AvoidThrowingObjCExceptionCheck.o
[251/1719] CXX obj/clang-tools-extra/clang-tidy/google/google.AvoidUnderscoreInGoogletestNameCheck.o
[252/1719] CXX obj/clang-tools-extra/clang-tidy/google/google.AvoidNSObjectNewCheck.o
[253/1719] CXX obj/clang-tools-extra/clang-tidy/google/google.AvoidCStyleCastsCheck.o
[254/1719] CXX obj/clang-tools-extra/clang-tidy/google/google.UsingNamespaceDirectiveCheck.o
[255/1719] CXX obj/clang-tools-extra/clang-tidy/hicpp/hicpp.ExceptionBaseclassCheck.o
[256/1719] CXX obj/clang-tools-extra/clang-tidy/hicpp/hicpp.IgnoredRemoveResultCheck.o
[257/1719] CXX obj/clang-tools-extra/clang-tidy/google/google.UpgradeGoogletestCaseCheck.o
[258/1719] CXX obj/clang-tools-extra/clang-tidy/hicpp/hicpp.NoAssemblerCheck.o
[259/1719] CXX obj/clang-tools-extra/clang-tidy/hicpp/hicpp.MultiwayPathsCoveredCheck.o
[260/1719] CXX obj/clang-tools-extra/clang-tidy/linuxkernel/linuxkernel.LinuxKernelTidyModule.o
[261/1719] CXX obj/clang-tools-extra/clang-tidy/hicpp/hicpp.HICPPTidyModule.o
[262/1719] CXX obj/clang-tools-extra/clang-tidy/hicpp/hicpp.SignedBitwiseCheck.o
[263/1719] CXX obj/clang-tools-extra/clang-tidy/linuxkernel/linuxkernel.MustCheckErrsCheck.o
[264/1719] CXX obj/clang-tools-extra/clang-tidy/llvm/llvm.HeaderGuardCheck.o
[265/1719] CXX obj/clang-tools-extra/clang-tidy/llvm/llvm.LLVMTidyModule.o
[266/1719] CXX obj/clang-tools-extra/clang-tidy/llvm/llvm.PreferIsaOrDynCastInConditionalsCheck.o
[267/1719] CXX obj/clang-tools-extra/clang-tidy/llvm/llvm.PreferRegisterOverUnsignedCheck.o
[268/1719] CXX obj/clang-tools-extra/clang-tidy/llvm/llvm.TwineLocalCheck.o
[269/1719] CXX obj/clang-tools-extra/clang-tidy/llvm/llvm.IncludeOrderCheck.o
[270/1719] CXX obj/clang-tools-extra/clang-tidy/llvmlibc/llvmlibc.CalleeNamespaceCheck.o
[271/1719] CXX obj/clang-tools-extra/clang-tidy/llvmlibc/llvmlibc.InlineFunctionDeclCheck.o
[272/1719] CXX obj/clang-tools-extra/clang-tidy/llvmlibc/llvmlibc.ImplementationInNamespaceCheck.o
[273/1719] CXX obj/clang-tools-extra/clang-tidy/llvmlibc/llvmlibc.LLVMLibcTidyModule.o
[274/1719] CXX obj/clang-tools-extra/clang-tidy/llvmlibc/llvmlibc.RestrictSystemLibcHeadersCheck.o
[275/1719] CXX obj/clang-tools-extra/clang-tidy/misc/misc.CoroutineHostileRAIICheck.o
[276/1719] CXX obj/clang-tools-extra/clang-tidy/misc/misc.DefinitionsInHeadersCheck.o
[277/1719] CXX obj/clang-tools-extra/clang-tidy/misc/misc.HeaderIncludeCycleCheck.o
[278/1719] CXX obj/clang-tools-extra/clang-tidy/misc/misc.ConstCorrectnessCheck.o
[279/1719] CXX obj/clang-tools-extra/clang-tidy/misc/misc.ConfusableIdentifierCheck.o
[280/1719] CXX obj/clang-tools-extra/clang-tidy/misc/misc.MisleadingBidirectional.o
[281/1719] CXX obj/clang-tools-extra/clang-tidy/misc/misc.IncludeCleanerCheck.o
[282/1719] CXX obj/clang-tools-extra/clang-tidy/misc/misc.MisleadingIdentifier.o
[283/1719] CXX obj/clang-tools-extra/clang-tidy/misc/misc.MiscTidyModule.o
[284/1719] CXX obj/clang-tools-extra/clang-tidy/misc/misc.MisplacedConstCheck.o
[285/1719] CXX obj/clang-tools-extra/clang-tidy/misc/misc.NewDeleteOverloadsCheck.o
[286/1719] CXX obj/clang-tools-extra/clang-tidy/misc/misc.NoRecursionCheck.o
[287/1719] CXX obj/clang-tools-extra/clang-tidy/misc/misc.NonCopyableObjects.o
[288/1719] CXX obj/clang-tools-extra/clang-tidy/misc/misc.NonPrivateMemberVariablesInClassesCheck.o
[289/1719] CXX obj/clang-tools-extra/clang-tidy/misc/misc.ThrowByValueCatchByReferenceCheck.o
[290/1719] CXX obj/clang-tools-extra/clang-tidy/misc/misc.RedundantExpressionCheck.o
[291/1719] CXX obj/clang-tools-extra/clang-tidy/misc/misc.UniqueptrResetReleaseCheck.o
[292/1719] CXX obj/clang-tools-extra/clang-tidy/misc/misc.UnconventionalAssignOperatorCheck.o
[293/1719] CXX obj/clang-tools-extra/clang-tidy/misc/misc.UnusedAliasDeclsCheck.o
[294/1719] CXX obj/clang-tools-extra/clang-tidy/misc/misc.StaticAssertCheck.o
[295/1719] CXX obj/clang-tools-extra/clang-tidy/misc/misc.UseAnonymousNamespaceCheck.o
[296/1719] CXX obj/clang-tools-extra/clang-tidy/misc/misc.UnusedUsingDeclsCheck.o
[297/1719] CXX obj/clang-tools-extra/clang-tidy/misc/misc.UseInternalLinkageCheck.o
[298/1719] CXX obj/clang-tools-extra/clang-tidy/modernize/modernize.AvoidCArraysCheck.o
[299/1719] CXX obj/clang-tools-extra/clang-tidy/modernize/modernize.AvoidBindCheck.o
[300/1719] CXX obj/clang-tools-extra/clang-tidy/modernize/modernize.ConcatNestedNamespacesCheck.o
[301/1719] CXX obj/clang-tools-extra/clang-tidy/modernize/modernize.DeprecatedIosBaseAliasesCheck.o
[302/1719] CXX obj/clang-tools-extra/clang-tidy/misc/misc.UnusedParametersCheck.o
[303/1719] CXX obj/clang-tools-extra/clang-apply-replacements/lib/Tooling/clang-apply-replacements.ApplyReplacements.o
[304/1719] CXX obj/clang-tools-extra/clang-apply-replacements/tool/clang-apply-replacements.ClangApplyReplacementsMain.o
[305/1719] CXX obj/clang-tools-extra/clang-change-namespace/clang-change-namespace.ChangeNamespace.o
[306/1719] CXX obj/clang-tools-extra/clang-change-namespace/tool/clang-change-namespace.ClangChangeNamespace.o
[307/1719] CXX obj/clang-tools-extra/clang-tidy/modernize/modernize.DeprecatedHeadersCheck.o
[308/1719] CXX obj/clang-tools-extra/clang-doc/clang-doc.BitcodeWriter.o
[309/1719] CXX obj/clang-tools-extra/clang-doc/clang-doc.BitcodeReader.o
[310/1719] CXX obj/clang-tools-extra/clang-doc/clang-doc.ClangDoc.o
[311/1719] CXX obj/clang-tools-extra/clang-doc/clang-doc.Generators.o
[312/1719] CXX obj/clang-tools-extra/clang-doc/clang-doc.HTMLGenerator.o
[313/1719] CXX obj/clang-tools-extra/clang-doc/clang-doc.MDGenerator.o
[314/1719] CXX obj/clang-tools-extra/clang-doc/clang-doc.Representation.o
[315/1719] CXX obj/clang-tools-extra/clang-tidy/modernize/modernize.LoopConvertCheck.o
[316/1719] CXX obj/clang-tools-extra/clang-doc/clang-doc.YAMLGenerator.o
[317/1719] CXX obj/clang-tools-extra/clang-doc/clang-doc.Serialize.o
[318/1719] CXX obj/clang-tools-extra/clang-include-fixer/clang-include-fixer.IncludeFixer.o
[319/1719] CXX obj/clang-tools-extra/clang-tidy/modernize/modernize.LoopConvertUtils.o
[320/1719] CXX obj/clang-tools-extra/clang-doc/tool/clang-doc.ClangDocMain.o
[321/1719] CXX obj/clang-tools-extra/clang-include-fixer/find-all-symbols/find-all-symbols.FindAllSymbolsAction.o
[322/1719] CXX obj/clang-tools-extra/clang-doc/clang-doc.Mapper.o
[323/1719] CXX obj/clang-tools-extra/clang-include-fixer/find-all-symbols/find-all-symbols.PragmaCommentHandler.o
[324/1719] CXX obj/clang-tools-extra/clang-include-fixer/find-all-symbols/find-all-symbols.FindAllSymbols.o
[325/1719] CXX obj/clang-tools-extra/clang-include-fixer/tool/clang-include-fixer.ClangIncludeFixer.o
[326/1719] CXX obj/clang-tools-extra/clang-move/clang-move.HelperDeclRefGraph.o
[327/1719] CXX obj/clang-tools-extra/clang-include-fixer/find-all-symbols/tool/find-all-symbols.FindAllSymbolsMain.o
[328/1719] CXX obj/clang-tools-extra/clang-query/clang-query.QueryParser.o
[329/1719] CXX obj/clang-tools-extra/clang-move/tool/clang-move.ClangMove.o
[330/1719] CXX obj/clang-tools-extra/clang-query/tool/clang-query.ClangQuery.o
[331/1719] CXX obj/clang-tools-extra/clang-move/clang-move.Move.o
[332/1719] CXX obj/clang-tools-extra/clang-reorder-fields/tool/clang-reorder-fields.ClangReorderFields.o
[333/1719] CXX obj/clang-tools-extra/clang-query/clang-query.Query.o
[334/1719] CXX obj/clang-tools-extra/clang-tidy/clang-tidy.ClangTidyDiagnosticConsumer.o
[335/1719] CXX obj/clang-tools-extra/clang-tidy/clang-tidy.ClangTidyCheck.o
[336/1719] CXX obj/clang-tools-extra/clang-tidy/clang-tidy.ClangTidyModule.o
[337/1719] CXX obj/clang-tools-extra/clang-reorder-fields/clang-reorder-fields.ReorderFieldsAction.o
[338/1719] CXX obj/clang-tools-extra/clang-tidy/clang-tidy.ClangTidy.o
[339/1719] CXX obj/clang-tools-extra/clang-tidy/abseil/abseil.DurationAdditionCheck.o
[340/1719] CXX obj/clang-tools-extra/clang-tidy/abseil/abseil.CleanupCtadCheck.o
[341/1719] CXX obj/clang-tools-extra/clang-tidy/clang-tidy.ExpandModularHeadersPPCallbacks.o
[342/1719] CXX obj/clang-tools-extra/clang-tidy/abseil/abseil.AbseilTidyModule.o
[343/1719] CXX obj/clang-tools-extra/clang-tidy/abseil/abseil.DurationConversionCastCheck.o
[344/1719] CXX obj/clang-tools-extra/clang-tidy/abseil/abseil.DurationComparisonCheck.o
[345/1719] CXX obj/clang-tools-extra/clang-tidy/abseil/abseil.DurationDivisionCheck.o
[346/1719] CXX obj/clang-tools-extra/clang-tidy/abseil/abseil.DurationFactoryFloatCheck.o
[347/1719] CXX obj/clang-tools-extra/clang-tidy/abseil/abseil.DurationFactoryScaleCheck.o
[348/1719] CXX obj/clang-tools-extra/clang-tidy/abseil/abseil.DurationRewriter.o
[349/1719] CXX obj/clang-tools-extra/clang-tidy/abseil/abseil.DurationSubtractionCheck.o
[350/1719] CXX obj/clang-tools-extra/clang-tidy/abseil/abseil.NoInternalDependenciesCheck.o
[351/1719] CXX obj/clang-tools-extra/clang-tidy/abseil/abseil.NoNamespaceCheck.o
[352/1719] CXX obj/clang-tools-extra/clang-tidy/abseil/abseil.DurationUnnecessaryConversionCheck.o
[353/1719] CXX obj/clang-tools-extra/clang-tidy/abseil/abseil.FasterStrsplitDelimiterCheck.o
[354/1719] CXX obj/clang-tools-extra/clang-tidy/abseil/abseil.RedundantStrcatCallsCheck.o
[355/1719] CXX obj/clang-tools-extra/clang-tidy/abseil/abseil.StrCatAppendCheck.o
[356/1719] CXX obj/clang-tools-extra/clang-tidy/abseil/abseil.StringFindStartswithCheck.o
[357/1719] CXX obj/clang-tools-extra/clang-tidy/abseil/abseil.TimeComparisonCheck.o
[358/1719] CXX obj/clang-tools-extra/clang-tidy/abseil/abseil.StringFindStrContainsCheck.o
[359/1719] CXX obj/clang-tools-extra/clang-tidy/abseil/abseil.TimeSubtractionCheck.o
[360/1719] CXX obj/clang-tools-extra/clang-tidy/altera/altera.AlteraTidyModule.o
[361/1719] CXX obj/clang-tools-extra/clang-tidy/abseil/abseil.UpgradeDurationConversionsCheck.o
[362/1719] CXX obj/clang-tools-extra/clang-tidy/altera/altera.IdDependentBackwardBranchCheck.o
[363/1719] CXX obj/clang-tools-extra/clang-tidy/altera/altera.SingleWorkItemBarrierCheck.o
[364/1719] CXX obj/clang-tools-extra/clang-tidy/altera/altera.KernelNameRestrictionCheck.o
[365/1719] CXX obj/clang-tools-extra/clang-tidy/altera/altera.StructPackAlignCheck.o
[366/1719] CXX obj/clang-tools-extra/clang-tidy/altera/altera.UnrollLoopsCheck.o
[367/1719] CXX obj/clang-tools-extra/clangd/refactor/tweaks/tweaks.ScopifyEnum.o
[368/1719] CXX obj/clang-tools-extra/clangd/refactor/tweaks/tweaks.SwapBinaryOperands.o
[369/1719] CXX obj/clang-tools-extra/clangd/refactor/tweaks/tweaks.SwapIfBranches.o
[370/1719] CXX obj/clang-tools-extra/clangd/refactor/tweaks/tweaks.SpecialMembers.o
[371/1719] CXX obj/clang-tools-extra/clangd/unittests/ClangdTests.ASTSignalsTests.o
[372/1719] CXX obj/clang-tools-extra/clangd/unittests/ClangdTests.ASTTests.o
[373/1719] CXX obj/clang-tools-extra/clangd/tool/clangd.Check.o
[374/1719] CXX obj/clang-tools-extra/clangd/tool/clangd.ClangdMain.o
[375/1719] CXX obj/clang-tools-extra/clangd/unittests/ClangdTests.CallHierarchyTests.o
[376/1719] CXX obj/clang-tools-extra/clangd/unittests/ClangdTests.CodeCompletionStringsTests.o
[377/1719] CXX obj/clang-tools-extra/clangd/unittests/ClangdTests.ClangdLSPServerTests.o
[378/1719] CXX obj/clang-tools-extra/clangd/unittests/ClangdTests.CollectMacrosTests.o
[379/1719] CXX obj/clang-tools-extra/clangd/unittests/ClangdTests.BackgroundIndexTests.o
[380/1719] CXX obj/clang-tools-extra/clangd/unittests/ClangdTests.CompilerTests.o
[381/1719] CXX obj/clang-tools-extra/clangd/unittests/ClangdTests.ClangdTests.o
[382/1719] CXX obj/clang-tools-extra/clangd/unittests/ClangdTests.ExpectedTypeTest.o
[383/1719] CXX obj/clang-tools-extra/clangd/unittests/ClangdTests.DumpASTTests.o
[384/1719] CXX obj/clang-tools-extra/clangd/unittests/ClangdTests.FeatureModulesTests.o
[385/1719] CXX obj/clang-tools-extra/clangd/unittests/ClangdTests.HeaderSourceSwitchTests.o
[386/1719] CXX obj/clang-tools-extra/clangd/unittests/ClangdTests.DiagnosticsTests.o
[387/1719] CXX obj/clang-tools-extra/clangd/unittests/ClangdTests.FindTargetTests.o
[388/1719] CXX obj/clang-tools-extra/clangd/unittests/ClangdTests.FileIndexTests.o
[389/1719] CXX obj/clang-tools-extra/clangd/unittests/ClangdTests.HeadersTests.o
[390/1719] CXX obj/clang-tools-extra/clangd/unittests/ClangdTests.FindSymbolsTests.o
[391/1719] CXX obj/clang-tools-extra/clangd/unittests/ClangdTests.IncludeCleanerTests.o
[392/1719] CXX obj/clang-tools-extra/clangd/unittests/ClangdTests.CodeCompleteTests.o
[393/1719] CXX obj/clang-tools-extra/clangd/unittests/ClangdTests.IndexActionTests.o
[394/1719] CXX obj/clang-tools-extra/clangd/unittests/ClangdTests.InsertionPointTests.o
[395/1719] CXX obj/clang-tools-extra/clangd/unittests/ClangdTests.ModulesTests.o
[396/1719] CXX obj/clang-tools-extra/clangd/unittests/ClangdTests.IndexTests.o
[397/1719] CXX obj/clang-tools-extra/clangd/unittests/ClangdTests.PrerequisiteModulesTest.o
[398/1719] CXX obj/clang-tools-extra/clangd/unittests/ClangdTests.InlayHintTests.o
[399/1719] CXX obj/clang-tools-extra/clangd/unittests/ClangdTests.QualityTests.o
[400/1719] CXX obj/clang-tools-extra/clangd/unittests/ClangdTests.PreambleTests.o
[401/1719] CXX obj/clang-tools-extra/clangd/unittests/ClangdTests.ParsedASTTests.o
[402/1719] CXX obj/clang-tools-extra/clangd/unittests/ClangdTests.ReplayPeambleTests.o
[403/1719] CXX obj/clang-tools-extra/clangd/unittests/ClangdTests.SemanticHighlightingTests.o
[404/1719] CXX obj/clang-tools-extra/clangd/unittests/ClangdTests.SelectionTests.o
[405/1719] CXX obj/clang-tools-extra/clangd/unittests/ClangdTests.SemanticSelectionTests.o
[406/1719] CXX obj/clang-tools-extra/clangd/unittests/ClangdTests.RenameTests.o
[407/1719] CXX obj/clang-tools-extra/clangd/unittests/ClangdTests.PrintASTTests.o
[408/1719] CXX obj/clang-tools-extra/clangd/unittests/ClangdTests.SerializationTests.o
[409/1719] CXX obj/clang-tools-extra/clangd/unittests/ClangdTests.StdLibTests.o
[410/1719] CXX obj/clang-tools-extra/clangd/unittests/ClangdTests.SourceCodeTests.o
[411/1719] CXX obj/clang-tools-extra/clangd/unittests/ClangdTests.HoverTests.o
[412/1719] CXX obj/clang-tools-extra/clangd/unittests/ClangdTests.SyncAPI.o
[413/1719] CXX obj/clang-tools-extra/clangd/unittests/ClangdTests.SymbolInfoTests.o
[414/1719] CXX obj/clang-tools-extra/clangd/unittests/ClangdTests.TestWorkspace.o
[415/1719] CXX obj/clang-tools-extra/clangd/unittests/tweaks/ClangdTests.AddUsingTests.o
[416/1719] CXX obj/clang-tools-extra/clangd/unittests/tweaks/ClangdTests.AnnotateHighlightingsTests.o
[417/1719] CXX obj/clang-tools-extra/clangd/unittests/tweaks/ClangdTests.DefineOutlineTests.o
[418/1719] CXX obj/clang-tools-extra/clangd/unittests/ClangdTests.TUSchedulerTests.o
[419/1719] CXX obj/clang-tools-extra/clangd/unittests/ClangdTests.TypeHierarchyTests.o
[420/1719] CXX obj/clang-tools-extra/clangd/unittests/tweaks/ClangdTests.DefineInlineTests.o
[421/1719] CXX obj/clang-tools-extra/clangd/unittests/tweaks/ClangdTests.DumpASTTests.o
[422/1719] CXX obj/clang-tools-extra/clangd/unittests/ClangdTests.SymbolCollectorTests.o
[423/1719] CXX obj/clang-tools-extra/clangd/unittests/ClangdTests.TestTU.o
[424/1719] CXX obj/clang-tools-extra/clangd/unittests/ClangdTests.XRefsTests.o
[425/1719] CXX obj/clang-tools-extra/clangd/unittests/tweaks/ClangdTests.DumpRecordLayoutTests.o
[426/1719] CXX obj/clang-tools-extra/clangd/unittests/tweaks/ClangdTests.DumpSymbolTests.o
[427/1719] CXX obj/clang-tools-extra/clangd/unittests/tweaks/ClangdTests.ExpandMacroTests.o
[428/1719] CXX obj/clang-tools-extra/clangd/unittests/tweaks/ClangdTests.ExtractVariableTests.o
[429/1719] CXX obj/clang-tools-extra/clangd/unittests/tweaks/ClangdTests.ExtractFunctionTests.o
[430/1719] CXX obj/clang-tools-extra/clangd/unittests/tweaks/ClangdTests.ExpandDeducedTypeTests.o
[431/1719] CXX obj/clang-tools-extra/clangd/unittests/tweaks/ClangdTests.MemberwiseConstructorTests.o
[432/1719] CXX obj/clang-tools-extra/clangd/unittests/tweaks/ClangdTests.ObjCLocalizeStringLiteralTests.o
[433/1719] CXX obj/clang-tools-extra/clangd/unittests/tweaks/ClangdTests.ObjCMemberwiseInitializerTests.o
[434/1719] CXX obj/clang-tools-extra/clangd/unittests/tweaks/ClangdTests.PopulateSwitchTests.o
[435/1719] CXX obj/clang-tools-extra/clangd/unittests/tweaks/ClangdTests.RawStringLiteralTests.o
[436/1719] CXX obj/clang-tools-extra/clangd/unittests/tweaks/ClangdTests.RemoveUsingNamespaceTests.o
[437/1719] CXX obj/clang-tools-extra/include-cleaner/lib/lib.FindHeaders.o
[438/1719] CXX obj/clang-tools-extra/clangd/unittests/tweaks/ClangdTests.ScopifyEnumTests.o
[439/1719] CXX obj/clang-tools-extra/clangd/unittests/tweaks/ClangdTests.SwapBinaryOperandsTests.o
[440/1719] CXX obj/clang-tools-extra/clangd/unittests/tweaks/ClangdTests.ShowSelectionTreeTests.o
[441/1719] CXX obj/clang-tools-extra/clangd/unittests/tweaks/ClangdTests.SpecialMembersTests.o
[442/1719] CXX obj/clang-tools-extra/clangd/unittests/tweaks/ClangdTests.SwapIfBranchesTests.o
[443/1719] CXX obj/clang-tools-extra/clangd/unittests/tweaks/ClangdTests.TweakTesting.o
[444/1719] CXX obj/clang-tools-extra/include-cleaner/lib/lib.LocateSymbol.o
[445/1719] CXX obj/clang-tools-extra/include-cleaner/lib/lib.HTMLReport.o
[446/1719] CXX obj/clang-tools-extra/clangd/unittests/tweaks/ClangdTests.TweakTests.o
[447/1719] CXX obj/clang-tools-extra/include-cleaner/lib/lib.Record.o
[448/1719] CXX obj/clang-tools-extra/modularize/modularize.ModularizeUtilities.o
[449/1719] CXX obj/clang-tools-extra/pp-trace/pp-trace.PPTrace.o
[450/1719] CXX obj/clang-tools-extra/modularize/modularize.CoverageChecker.o
[451/1719] CXX obj/clang-tools-extra/unittests/clang-apply-replacements/ClangApplyReplacementsTests.ApplyReplacementsTest.o
[452/1719] CXX obj/clang-tools-extra/unittests/clang-doc/ClangDocTests.ClangDocTest.o
[453/1719] CXX obj/clang-tools-extra/unittests/clang-doc/ClangDocTests.BitcodeTest.o
[454/1719] CXX obj/clang-tools-extra/include-cleaner/lib/lib.WalkAST.o
[455/1719] CXX obj/clang-tools-extra/unittests/clang-change-namespace/ClangChangeNamespaceTests.ChangeNamespaceTests.o
[456/1719] CXX obj/clang-tools-extra/modularize/modularize.Modularize.o
[457/1719] CXX obj/clang-tools-extra/unittests/clang-doc/ClangDocTests.GeneratorTest.o
[458/1719] CXX obj/clang-tools-extra/unittests/clang-doc/ClangDocTests.HTMLGeneratorTest.o
[459/1719] CXX obj/clang-tools-extra/unittests/clang-doc/ClangDocTests.MDGeneratorTest.o
[460/1719] CXX obj/clang-tools-extra/unittests/clang-doc/ClangDocTests.MergeTest.o
[461/1719] CXX obj/clang-tools-extra/unittests/clang-include-fixer/ClangIncludeFixerTests.IncludeFixerTest.o
[462/1719] CXX obj/clang-tools-extra/unittests/clang-doc/ClangDocTests.YAMLGeneratorTest.o
[463/1719] CXX obj/clang-tools-extra/unittests/clang-query/ClangQueryTests.QueryEngineTest.o
[464/1719] CXX obj/clang-tools-extra/unittests/clang-query/ClangQueryTests.QueryParserTest.o
[465/1719] CXX obj/clang-tools-extra/unittests/clang-include-fixer/find-all-symbols/FindAllSymbolsTests.FindAllSymbolsTests.o
[466/1719] CXX obj/clang-tools-extra/unittests/clang-move/ClangMoveTests.ClangMoveTests.o
[467/1719] CXX obj/clang-tools-extra/unittests/clang-doc/ClangDocTests.SerializeTest.o
[468/1719] CXX obj/clang-tools-extra/unittests/clang-tidy/ClangTidyTests.ClangTidyDiagnosticConsumerTest.o
[469/1719] CXX obj/clang-tools-extra/unittests/clang-tidy/ClangTidyTests.ClangTidyOptionsTest.o
[470/1719] CXX obj/clang-tools-extra/unittests/clang-tidy/ClangTidyTests.AddConstTest.o
[471/1719] CXX obj/clang-tools-extra/unittests/clang-tidy/ClangTidyTests.DeclRefExprUtilsTest.o
[472/1719] CXX obj/clang-tools-extra/unittests/clang-tidy/ClangTidyTests.GoogleModuleTest.o
[473/1719] CXX obj/clang-tools-extra/unittests/clang-tidy/ClangTidyTests.LLVMModuleTest.o
[474/1719] CXX obj/clang-tools-extra/unittests/clang-tidy/ClangTidyTests.IncludeCleanerTest.o
[475/1719] CXX obj/clang-tools-extra/unittests/clang-tidy/ClangTidyTests.ModernizeModuleTest.o
[476/1719] CXX obj/clang-tools-extra/unittests/clang-tidy/ClangTidyTests.IncludeInserterTest.o
[477/1719] CXX obj/clang-tools-extra/unittests/clang-tidy/ClangTidyTests.NamespaceAliaserTest.o
[478/1719] CXX obj/clang-tools-extra/unittests/clang-tidy/ClangTidyTests.ObjCModuleTest.o
[479/1719] CXX obj/clang-tools-extra/unittests/clang-tidy/ClangTidyTests.ReadabilityModuleTest.o
[480/1719] CXX obj/clang-tools-extra/clang-tidy/modernize/modernize.MakeUniqueCheck.o
[481/1719] CXX obj/clang-tools-extra/clang-tidy/modernize/modernize.MinMaxUseInitializerListCheck.o
[482/1719] CXX obj/clang-tools-extra/unittests/clang-tidy/ClangTidyTests.UsingInserterTest.o
[483/1719] CXX obj/clang-tools-extra/clang-tidy/modernize/modernize.RawStringLiteralCheck.o
[484/1719] CXX obj/clang-tools-extra/unittests/clang-tidy/ClangTidyTests.TransformerClangTidyCheckTest.o
[485/1719] CXX obj/clang-tools-extra/clang-tidy/modernize/modernize.RedundantVoidArgCheck.o
[486/1719] CXX obj/clang-tools-extra/unittests/clang-tidy/ClangTidyTests.OverlappingReplacementsTest.o
[487/1719] CXX obj/clang-tools-extra/clang-tidy/modernize/modernize.ModernizeTidyModule.o
[488/1719] CXX obj/clang-tools-extra/clang-tidy/modernize/modernize.ReplaceAutoPtrCheck.o
[489/1719] CXX obj/clang-tools-extra/clang-tidy/modernize/modernize.ReplaceDisallowCopyAndAssignMacroCheck.o
[490/1719] CXX obj/clang-tools-extra/clang-tidy/modernize/modernize.ReturnBracedInitListCheck.o
[491/1719] CXX obj/clang-tools-extra/clang-tidy/modernize/modernize.ReplaceRandomShuffleCheck.o
[492/1719] CXX obj/clang-tools-extra/clang-tidy/modernize/modernize.TypeTraitsCheck.o
[493/1719] CXX obj/clang-tools-extra/clang-tidy/modernize/modernize.ShrinkToFitCheck.o
[494/1719] CXX obj/clang-tools-extra/clang-tidy/modernize/modernize.UnaryStaticAssertCheck.o
[495/1719] CXX obj/clang-tools-extra/clang-tidy/modernize/modernize.PassByValueCheck.o
[496/1719] CXX obj/clang-tools-extra/clang-tidy/modernize/modernize.UseBoolLiteralsCheck.o
[497/1719] CXX obj/clang-tools-extra/clang-tidy/modernize/modernize.UseConstraintsCheck.o
[498/1719] CXX obj/clang-tools-extra/clang-tidy/modernize/modernize.UseAutoCheck.o
[499/1719] CXX obj/clang-tools-extra/clang-tidy/modernize/modernize.UseDesignatedInitializersCheck.o
[500/1719] CXX obj/clang-tools-extra/clang-tidy/modernize/modernize.UseDefaultMemberInitCheck.o
[501/1719] CXX obj/clang-tools-extra/clang-tidy/modernize/modernize.UseEqualsDeleteCheck.o
[502/1719] CXX obj/clang-tools-extra/clang-tidy/modernize/modernize.UseIntegerSignComparisonCheck.o
[503/1719] CXX obj/clang-tools-extra/clang-tidy/modernize/modernize.UseEmplaceCheck.o
[504/1719] CXX obj/clang-tools-extra/clang-tidy/modernize/modernize.UseNoexceptCheck.o
[505/1719] CXX obj/clang-tools-extra/clang-tidy/modernize/modernize.UseEqualsDefaultCheck.o
[506/1719] CXX obj/clang-tools-extra/clang-tidy/modernize/modernize.UseNodiscardCheck.o
[507/1719] CXX obj/clang-tools-extra/clang-tidy/modernize/modernize.UseOverrideCheck.o
[508/1719] CXX obj/clang-tools-extra/clang-tidy/modernize/modernize.UseRangesCheck.o
[509/1719] CXX obj/clang-tools-extra/clang-tidy/modernize/modernize.UseStdFormatCheck.o
[510/1719] CXX obj/clang-tools-extra/clang-tidy/modernize/modernize.UseStartsEndsWithCheck.o
[511/1719] CXX obj/clang-tools-extra/clang-tidy/modernize/modernize.UseStdPrintCheck.o
[512/1719] CXX obj/clang-tools-extra/clang-tidy/modernize/modernize.UseStdNumbersCheck.o
[513/1719] CXX obj/clang-tools-extra/clang-tidy/modernize/modernize.UseUncaughtExceptionsCheck.o
[514/1719] CXX obj/clang-tools-extra/clang-tidy/modernize/modernize.UseTransparentFunctorsCheck.o
[515/1719] CXX obj/clang-tools-extra/clang-tidy/modernize/modernize.UseUsingCheck.o
[516/1719] CXX obj/clang-tools-extra/clang-tidy/mpi/mpi.BufferDerefCheck.o
[517/1719] CXX obj/clang-tools-extra/clang-tidy/mpi/mpi.MPITidyModule.o
[518/1719] CXX obj/clang-tools-extra/clang-tidy/objc/objc.AvoidNSErrorInitCheck.o
[519/1719] CXX obj/clang-tools-extra/clang-tidy/mpi/mpi.TypeMismatchCheck.o
[520/1719] CXX obj/clang-tools-extra/clang-tidy/objc/objc.AssertEquals.o
[521/1719] CXX obj/clang-tools-extra/clang-tidy/objc/objc.DeallocInCategoryCheck.o
[522/1719] CXX obj/clang-tools-extra/clang-tidy/objc/objc.ForbiddenSubclassingCheck.o
[523/1719] CXX obj/clang-tools-extra/clang-tidy/objc/objc.MissingHashCheck.o
[524/1719] CXX obj/clang-tools-extra/clang-tidy/modernize/modernize.UseTrailingReturnTypeCheck.o
[525/1719] CXX obj/clang-tools-extra/clang-tidy/objc/objc.NSDateFormatterCheck.o
[526/1719] CXX obj/clang-tools-extra/clang-tidy/modernize/modernize.UseNullptrCheck.o
[527/1719] CXX obj/clang-tools-extra/clang-tidy/objc/objc.NSInvocationArgumentLifetimeCheck.o
[528/1719] CXX obj/clang-tools-extra/clang-tidy/objc/objc.PropertyDeclarationCheck.o
[529/1719] CXX obj/clang-tools-extra/clang-tidy/objc/objc.SuperSelfCheck.o
[530/1719] CXX obj/clang-tools-extra/clang-tidy/openmp/openmp.OpenMPTidyModule.o
[531/1719] CXX obj/clang-tools-extra/clang-tidy/openmp/openmp.ExceptionEscapeCheck.o
[532/1719] CXX obj/clang-tools-extra/clang-tidy/objc/objc.ObjCTidyModule.o
[533/1719] CXX obj/clang-tools-extra/clang-tidy/openmp/openmp.UseDefaultNoneCheck.o
[534/1719] CXX obj/clang-tools-extra/clang-tidy/performance/performance.AvoidEndlCheck.o
[535/1719] CXX obj/clang-tools-extra/clang-tidy/performance/performance.EnumSizeCheck.o
[536/1719] CXX obj/clang-tools-extra/clang-tidy/performance/performance.FasterStringFindCheck.o
[537/1719] CXX obj/clang-tools-extra/clang-tidy/performance/performance.ImplicitConversionInLoopCheck.o
[538/1719] CXX obj/clang-tools-extra/clang-tidy/performance/performance.InefficientAlgorithmCheck.o
[539/1719] CXX obj/clang-tools-extra/clang-tidy/performance/performance.InefficientStringConcatenationCheck.o
[540/1719] CXX obj/clang-tools-extra/clang-tidy/performance/performance.ForRangeCopyCheck.o
[541/1719] CXX obj/clang-tools-extra/clang-tidy/performance/performance.InefficientVectorOperationCheck.o
[542/1719] CXX obj/clang-tools-extra/clang-tidy/performance/performance.MoveConstructorInitCheck.o
[543/1719] CXX obj/clang-tools-extra/clang-tidy/performance/performance.MoveConstArgCheck.o
[544/1719] CXX obj/clang-tools-extra/clang-tidy/performance/performance.NoIntToPtrCheck.o
[545/1719] CXX obj/clang-tools-extra/clang-tidy/performance/performance.NoAutomaticMoveCheck.o
[546/1719] CXX obj/clang-tools-extra/clang-tidy/performance/performance.NoexceptDestructorCheck.o
[547/1719] CXX obj/clang-tools-extra/clang-tidy/performance/performance.NoexceptFunctionBaseCheck.o
[548/1719] CXX obj/clang-tools-extra/clang-tidy/performance/performance.NoexceptMoveConstructorCheck.o
[549/1719] CXX obj/clang-tools-extra/clang-tidy/performance/performance.NoexceptSwapCheck.o
[550/1719] CXX obj/clang-tools-extra/clang-tidy/performance/performance.TriviallyDestructibleCheck.o
[551/1719] CXX obj/clang-tools-extra/clang-tidy/performance/performance.PerformanceTidyModule.o
[552/1719] CXX obj/clang-tools-extra/clang-tidy/performance/performance.UnnecessaryCopyInitialization.o
[553/1719] CXX obj/clang-tools-extra/clang-tidy/performance/performance.TypePromotionInMathFnCheck.o
[554/1719] CXX obj/clang-tools-extra/clang-tidy/portability/portability.PortabilityTidyModule.o
[555/1719] CXX obj/clang-tools-extra/clang-tidy/performance/performance.UnnecessaryValueParamCheck.o
[556/1719] CXX obj/clang-tools-extra/clang-tidy/portability/portability.SIMDIntrinsicsCheck.o
[557/1719] CXX obj/clang-tools-extra/clang-tidy/portability/portability.StdAllocatorConstCheck.o
[558/1719] CXX obj/clang-tools-extra/clang-tidy/portability/portability.RestrictSystemIncludesCheck.o
[559/1719] CXX obj/clang-tools-extra/clang-tidy/portability/portability.TemplateVirtualMemberFunctionCheck.o
[560/1719] CXX obj/clang-tools-extra/clang-tidy/readability/readability.AvoidConstParamsInDecls.o
[561/1719] CXX obj/clang-tools-extra/clang-tidy/readability/readability.AmbiguousSmartptrResetCallCheck.o
[562/1719] CXX obj/clang-tools-extra/clang-tidy/readability/readability.AvoidNestedConditionalOperatorCheck.o
[563/1719] CXX obj/clang-tools-extra/clang-tidy/readability/readability.AvoidReturnWithVoidValueCheck.o
[564/1719] CXX obj/clang-tools-extra/clang-tidy/readability/readability.BracesAroundStatementsCheck.o
[565/1719] CXX obj/clang-tools-extra/clang-tidy/readability/readability.ConstReturnTypeCheck.o
[566/1719] CXX obj/clang-tools-extra/clang-tidy/readability/readability.AvoidUnconditionalPreprocessorIfCheck.o
[567/1719] CXX obj/clang-tools-extra/clang-tidy/readability/readability.ContainerDataPointerCheck.o
[568/1719] CXX obj/clang-tools-extra/clang-tidy/readability/readability.ContainerContainsCheck.o
[569/1719] CXX obj/clang-tools-extra/clang-tidy/readability/readability.DeleteNullPointerCheck.o
[570/1719] CXX obj/clang-tools-extra/clang-tidy/readability/readability.EnumInitialValueCheck.o
[571/1719] CXX obj/clang-tools-extra/clang-tidy/readability/readability.ContainerSizeEmptyCheck.o
[572/1719] CXX obj/clang-tools-extra/clang-tidy/readability/readability.DuplicateIncludeCheck.o
[573/1719] CXX obj/clang-tools-extra/clang-tidy/readability/readability.ElseAfterReturnCheck.o
[574/1719] CXX obj/clang-tools-extra/clang-tidy/readability/readability.IdentifierLengthCheck.o
[575/1719] CXX obj/clang-tools-extra/clang-tidy/readability/readability.ConvertMemberFunctionsToStatic.o
[576/1719] CXX obj/clang-tools-extra/clang-tidy/readability/readability.IdentifierNamingCheck.o
[577/1719] CXX obj/clang-tools-extra/clang-tidy/readability/readability.ImplicitBoolConversionCheck.o
[578/1719] CXX obj/clang-tools-extra/clang-tidy/readability/readability.IsolateDeclarationCheck.o
[579/1719] CXX obj/clang-tools-extra/clang-tidy/readability/readability.MagicNumbersCheck.o
[580/1719] CXX obj/clang-tools-extra/clang-tidy/readability/readability.InconsistentDeclarationParameterNameCheck.o
[581/1719] CXX obj/clang-tools-extra/clang-tidy/readability/readability.FunctionCognitiveComplexityCheck.o
[582/1719] CXX obj/clang-tools-extra/clang-tidy/readability/readability.MathMissingParenthesesCheck.o
[583/1719] CXX obj/clang-tools-extra/clang-tidy/readability/readability.FunctionSizeCheck.o
[584/1719] CXX obj/clang-tools-extra/clang-tidy/readability/readability.MisleadingIndentationCheck.o
[585/1719] CXX obj/clang-tools-extra/clang-tidy/readability/readability.MisplacedArrayIndexCheck.o
[586/1719] CXX obj/clang-tools-extra/clang-tidy/readability/readability.NamedParameterCheck.o
[587/1719] CXX obj/clang-tools-extra/clang-tidy/readability/readability.NamespaceCommentCheck.o
[588/1719] CXX obj/clang-tools-extra/clang-tidy/readability/readability.NonConstParameterCheck.o
[589/1719] CXX obj/clang-tools-extra/clang-tidy/readability/readability.OperatorsRepresentationCheck.o
[590/1719] CXX obj/clang-tools-extra/clang-tidy/readability/readability.MakeMemberFunctionConstCheck.o
[591/1719] CXX obj/clang-tools-extra/clang-tidy/readability/readability.RedundantAccessSpecifiersCheck.o
[592/1719] CXX obj/clang-tools-extra/clang-tidy/readability/readability.QualifiedAutoCheck.o
[593/1719] CXX obj/clang-tools-extra/clang-tidy/readability/readability.RedundantCastingCheck.o
[594/1719] CXX obj/clang-tools-extra/clang-tidy/readability/readability.RedundantDeclarationCheck.o
[595/1719] CXX obj/clang-tools-extra/clang-tidy/readability/readability.RedundantControlFlowCheck.o
[596/1719] CXX obj/clang-tools-extra/clang-tidy/readability/readability.RedundantFunctionPtrDereferenceCheck.o
[597/1719] CXX obj/clang-tools-extra/clang-tidy/readability/readability.RedundantInlineSpecifierCheck.o
[598/1719] CXX obj/clang-tools-extra/clang-tidy/readability/readability.ReadabilityTidyModule.o
[599/1719] CXX obj/clang-tools-extra/clang-tidy/readability/readability.RedundantMemberInitCheck.o
[600/1719] CXX obj/clang-tools-extra/clang-tidy/readability/readability.RedundantPreprocessorCheck.o
[601/1719] CXX obj/clang-tools-extra/clang-tidy/readability/readability.RedundantSmartptrGetCheck.o
[602/1719] CXX obj/clang-tools-extra/clang-tidy/readability/readability.RedundantStringCStrCheck.o
[603/1719] CXX obj/clang-tools-extra/clang-tidy/readability/readability.ReferenceToConstructedTemporaryCheck.o
[604/1719] CXX obj/clang-tools-extra/clang-tidy/readability/readability.RedundantStringInitCheck.o
[605/1719] CXX obj/clang-tools-extra/clang-tidy/readability/readability.SimplifySubscriptExprCheck.o
[606/1719] CXX obj/clang-tools-extra/clang-tidy/readability/readability.StaticAccessedThroughInstanceCheck.o
[607/1719] CXX obj/clang-tools-extra/clang-tidy/readability/readability.StringCompareCheck.o
[608/1719] CXX obj/clang-tools-extra/clang-tidy/readability/readability.SuspiciousCallArgumentCheck.o
[609/1719] CXX obj/clang-tools-extra/clang-tidy/readability/readability.StaticDefinitionInAnonymousNamespaceCheck.o
[610/1719] CXX obj/clang-tools-extra/clang-tidy/utils/utils.Aliasing.o
[611/1719] CXX obj/clang-tools-extra/clang-tidy/utils/utils.BracesAroundStatement.o
[612/1719] CXX obj/clang-tools-extra/clang-tidy/readability/readability.UppercaseLiteralSuffixCheck.o
[613/1719] CXX obj/clang-tools-extra/clang-tidy/readability/readability.UniqueptrDeleteReleaseCheck.o
[614/1719] CXX obj/clang-tools-extra/clang-tidy/utils/utils.ASTUtils.o
[615/1719] CXX obj/clang-tools-extra/clang-tidy/readability/readability.SimplifyBooleanExprCheck.o
[616/1719] CXX obj/clang-tools-extra/clang-tidy/readability/readability.UseAnyOfAllOfCheck.o
[617/1719] CXX obj/clang-tools-extra/clang-tidy/readability/readability.UseStdMinMaxCheck.o
[618/1719] CXX obj/clang-tools-extra/clang-tidy/utils/utils.FixItHintUtils.o
[619/1719] CXX obj/clang-tools-extra/clang-tidy/utils/utils.ExprSequence.o
[620/1719] CXX obj/clang-tools-extra/clang-tidy/utils/utils.DeclRefExprUtils.o
[621/1719] CXX obj/clang-tools-extra/clang-tidy/utils/utils.ExceptionAnalyzer.o
[622/1719] CXX obj/clang-tools-extra/clang-tidy/utils/utils.LexerUtils.o
[623/1719] CXX obj/clang-tools-extra/clang-tidy/utils/utils.IncludeSorter.o
[624/1719] CXX obj/clang-tools-extra/clang-tidy/utils/utils.FormatStringConverter.o
[625/1719] CXX obj/clang-tools-extra/clang-tidy/utils/utils.IncludeInserter.o
[626/1719] CXX obj/clang-tools-extra/clang-tidy/utils/utils.Matchers.o
[627/1719] CXX obj/clang-tools-extra/clang-tidy/utils/utils.HeaderGuard.o
[628/1719] CXX obj/clang-tools-extra/clang-tidy/utils/utils.NamespaceAliaser.o
[629/1719] CXX obj/clang-tools-extra/clang-tidy/utils/utils.TypeTraits.o
[630/1719] CXX obj/clang-tools-extra/clang-tidy/utils/utils.TransformerClangTidyCheck.o
[631/1719] CXX obj/clang-tools-extra/clang-tidy/utils/utils.UseRangesCheck.o
[632/1719] CXX obj/clang-tools-extra/clang-tidy/zircon/zircon.ZirconTidyModule.o
[633/1719] CXX obj/clang-tools-extra/clang-tidy/zircon/zircon.TemporaryObjectsCheck.o
[634/1719] CXX obj/clang-tools-extra/clang-tidy/utils/utils.UsingInserter.o
[635/1719] CXX obj/clang-tools-extra/clangd/clangd.ASTSignals.o
[636/1719] CXX obj/clang-tools-extra/clangd/clangd.CodeCompletionStrings.o
[637/1719] CXX obj/clang-tools-extra/clang-tidy/utils/utils.RenamerClangTidyCheck.o
[638/1719] CXX obj/clang-tools-extra/clangd/clangd.Compiler.o
[639/1719] CXX obj/clang-tools-extra/clangd/clangd.CollectMacros.o
[640/1719] CXX obj/clang-tools-extra/clangd/clangd.ExpectedTypes.o
[641/1719] CXX obj/clang-tools-extra/clangd/clangd.CompileCommands.o
[642/1719] CXX obj/clang-tools-extra/clangd/clangd.Diagnostics.o
[643/1719] CXX obj/clang-tools-extra/clangd/clangd.ClangdServer.o
[644/1719] CXX obj/clang-tools-extra/clangd/clangd.CodeComplete.o
[645/1719] CXX obj/clang-tools-extra/clangd/clangd.AST.o
[646/1719] CXX obj/clang-tools-extra/clangd/clangd.FindSymbols.o
[647/1719] CXX obj/clang-tools-extra/clangd/clangd.ClangdLSPServer.o
[648/1719] CXX obj/clang-tools-extra/clangd/clangd.HeaderSourceSwitch.o
[649/1719] CXX obj/clang-tools-extra/clangd/clangd.GlobalCompilationDatabase.o
[650/1719] CXX obj/clang-tools-extra/clangd/clangd.DumpAST.o
[651/1719] CXX obj/clang-tools-extra/clangd/clangd.Headers.o
[652/1719] CXX obj/clang-tools-extra/clangd/clangd.Hover.o
[653/1719] CXX obj/clang-tools-extra/clangd/clangd.IncludeCleaner.o
[654/1719] CXX obj/clang-tools-extra/clangd/clangd.FindTarget.o
[655/1719] CXX obj/clang-tools-extra/clangd/clangd.IncludeFixer.o
[656/1719] CXX obj/clang-tools-extra/clangd/clangd.ModulesBuilder.o
[657/1719] CXX obj/clang-tools-extra/clangd/clangd.Quality.o
[658/1719] CXX obj/clang-tools-extra/clangd/clangd.ScanningProjectModules.o
[659/1719] CXX obj/clang-tools-extra/clangd/clangd.Preamble.o
[660/1719] CXX obj/clang-tools-extra/clangd/clangd.ParsedAST.o
[661/1719] CXX obj/clang-tools-extra/clangd/clangd.SemanticSelection.o
[662/1719] CXX obj/clang-tools-extra/clangd/clangd.InlayHints.o
[663/1719] CXX obj/clang-tools-extra/clangd/clangd.SourceCode.o
[664/1719] CXX obj/clang-tools-extra/clangd/clangd.TUScheduler.o
[665/1719] CXX obj/clang-tools-extra/clangd/index/clangd.BackgroundIndexLoader.o
[666/1719] CXX obj/clang-tools-extra/clangd/index/clangd.Background.o
[667/1719] CXX obj/clang-tools-extra/clangd/clangd.Selection.o
[668/1719] CXX obj/clang-tools-extra/clangd/index/clangd.BackgroundIndexStorage.o
[669/1719] CXX obj/clang-tools-extra/clangd/index/clangd.BackgroundQueue.o
[670/1719] CXX obj/clang-tools-extra/clangd/index/clangd.BackgroundRebuild.o
[671/1719] CXX obj/clang-tools-extra/clangd/clangd.SemanticHighlighting.o
[672/1719] CXX obj/clang-tools-extra/clangd/index/clangd.IndexAction.o
[673/1719] CXX obj/clang-tools-extra/clangd/refactor/clangd.InsertionPoint.o
[674/1719] CXX obj/clang-tools-extra/clangd/index/clangd.FileIndex.o
[675/1719] CXX obj/clang-tools-extra/clangd/index/clangd.Serialization.o
[676/1719] CXX obj/clang-tools-extra/clangd/index/clangd.YAMLSerialization.o
[677/1719] CXX obj/clang-tools-extra/clangd/index/clangd.StdLib.o
[678/1719] CXX obj/clang-tools-extra/clangd/index/clangd.SymbolCollector.o
[679/1719] CXX obj/clang-tools-extra/clangd/refactor/clangd.Tweak.o
[680/1719] CXX obj/clang-tools-extra/clangd/clangd.XRefs.o
[681/1719] CXX obj/clang-tools-extra/clangd/refactor/clangd.Rename.o
[682/1719] CXX obj/clang-tools-extra/clangd/indexer/clangd-indexer.IndexerMain.o
[683/1719] CXX obj/clang-tools-extra/clangd/index/dex/dexp/dexp.Dexp.o
[684/1719] CXX obj/clang-tools-extra/clangd/refactor/tweaks/tweaks.AnnotateHighlightings.o
[685/1719] CXX obj/clang-tools-extra/clangd/refactor/tweaks/tweaks.DefineOutline.o
[686/1719] CXX obj/clang-tools-extra/clangd/refactor/tweaks/tweaks.DumpAST.o
[687/1719] CXX obj/clang-tools-extra/clangd/refactor/tweaks/tweaks.DefineInline.o
[688/1719] CXX obj/clang-tools-extra/clangd/refactor/tweaks/tweaks.ExpandDeducedType.o
[689/1719] CXX obj/clang-tools-extra/clangd/refactor/tweaks/tweaks.ExpandMacro.o
[690/1719] CXX obj/clang-tools-extra/clangd/refactor/tweaks/tweaks.MemberwiseConstructor.o
[691/1719] CXX obj/clang/lib/AST/ByteCode/AST.Program.o
[692/1719] CXX obj/clang-tools-extra/clangd/refactor/tweaks/tweaks.AddUsing.o
[693/1719] CXX obj/clang-tools-extra/clangd/refactor/tweaks/tweaks.ObjCLocalizeStringLiteral.o
[694/1719] CXX obj/clang/lib/AST/ByteCode/AST.Record.o
[695/1719] CXX obj/clang-tools-extra/clangd/refactor/tweaks/tweaks.PopulateSwitch.o
[696/1719] CXX obj/clang-tools-extra/clangd/refactor/tweaks/tweaks.ObjCMemberwiseInitializer.o
[697/1719] CXX obj/clang-tools-extra/clangd/refactor/tweaks/tweaks.RawStringLiteral.o
[698/1719] CXX obj/clang/lib/AST/ByteCode/AST.State.o
[699/1719] CXX obj/clang/lib/AST/AST.Comment.o
[700/1719] CXX obj/clang/lib/AST/AST.CXXInheritance.o
[701/1719] CXX obj/clang/lib/AST/AST.ComparisonCategories.o
[702/1719] CXX obj/clang/lib/AST/AST.DataCollection.o
[703/1719] CXX obj/clang/lib/AST/AST.ComputeDependence.o
[704/1719] CXX obj/clang/lib/AST/AST.CommentSema.o
[705/1719] CXX obj/clang-tools-extra/clangd/refactor/tweaks/tweaks.ExtractVariable.o
[706/1719] CXX obj/clang/lib/AST/AST.DeclGroup.o
[707/1719] CXX obj/clang/lib/AST/AST.DeclFriend.o
[708/1719] CXX obj/clang/lib/AST/AST.DeclOpenACC.o
[709/1719] CXX obj/clang/lib/AST/AST.DeclOpenMP.o
[710/1719] CXX obj/clang/lib/AST/AST.DeclBase.o
[711/1719] CXX obj/clang/lib/AST/AST.DeclCXX.o
[712/1719] CXX obj/clang/lib/AST/AST.Decl.o
[713/1719] CXX obj/clang/lib/AST/AST.DeclObjC.o
[714/1719] CXX obj/clang/lib/AST/AST.DeclTemplate.o
[715/1719] CXX obj/clang-tools-extra/clangd/refactor/tweaks/tweaks.ExtractFunction.o
[716/1719] CXX obj/clang/lib/AST/AST.DeclarationName.o
[717/1719] CXX obj/clang-tools-extra/clangd/refactor/tweaks/tweaks.RemoveUsingNamespace.o
[718/1719] CXX obj/clang/lib/AST/AST.DeclPrinter.o
[719/1719] CXX obj/clang/lib/AST/AST.ExprConcepts.o
[720/1719] CXX obj/clang/lib/AST/AST.ExprClassification.o
[721/1719] CXX obj/clang/lib/AST/AST.ExprCXX.o
[722/1719] CXX obj/clang/lib/AST/AST.ExternalASTSource.o
[723/1719] CXX obj/clang/lib/AST/AST.ExprObjC.o
[724/1719] CXX obj/clang/lib/AST/AST.FormatString.o
[725/1719] CXX obj/clang/lib/AST/AST.ExternalASTMerger.o
[726/1719] CXX obj/clang/lib/AST/AST.InheritViz.o
[727/1719] CXX obj/clang/lib/AST/AST.ItaniumCXXABI.o
[728/1719] CXX obj/clang/lib/AST/AST.Expr.o
[729/1719] CXX obj/clang/lib/AST/AST.Mangle.o
[730/1719] CXX obj/clang/lib/AST/AST.NSAPI.o
[731/1719] CXX obj/clang/lib/AST/AST.MicrosoftCXXABI.o
[732/1719] CXX obj/clang/lib/AST/AST.NestedNameSpecifier.o
[733/1719] CXX obj/clang/lib/AST/AST.ItaniumMangle.o
[734/1719] CXX obj/clang/lib/AST/AST.OSLog.o
[735/1719] CXX obj/clang/lib/AST/AST.ODRHash.o
[736/1719] CXX obj/clang/lib/AST/AST.JSONNodeDumper.o
[737/1719] CXX obj/clang/lib/AST/AST.OpenACCClause.o
[738/1719] CXX obj/clang/lib/AST/AST.MicrosoftMangle.o
[739/1719] CXX obj/clang/lib/AST/AST.ODRDiagsEmitter.o
[740/1719] CXX obj/clang/lib/AST/AST.PrintfFormatString.o
[741/1719] CXX obj/clang/lib/AST/AST.Randstruct.o
[742/1719] CXX obj/clang/lib/AST/AST.RecordLayout.o
[743/1719] CXX obj/clang/lib/AST/AST.RawCommentList.o
[744/1719] CXX obj/clang/lib/AST/AST.QualTypeNames.o
[745/1719] CXX obj/clang/lib/AST/AST.OpenMPClause.o
[746/1719] CXX obj/clang/lib/AST/AST.ScanfFormatString.o
[747/1719] CXX obj/clang/lib/AST/AST.StmtObjC.o
[748/1719] CXX obj/clang/lib/AST/AST.StmtCXX.o
[749/1719] CXX obj/clang/lib/AST/AST.RecordLayoutBuilder.o
[750/1719] CXX obj/clang/lib/AST/AST.StmtOpenACC.o
[751/1719] CXX obj/clang/lib/AST/AST.DynamicRecursiveASTVisitor.o
[752/1719] CXX obj/clang/lib/AST/AST.StmtOpenMP.o
[753/1719] CXX obj/clang/lib/AST/AST.TemplateBase.o
[754/1719] CXX obj/clang/lib/AST/AST.TemplateName.o
[755/1719] CXX obj/clang/lib/AST/AST.Stmt.o
[756/1719] CXX obj/clang/lib/AST/AST.ExprConstant.o
[757/1719] CXX obj/clang/lib/AST/AST.StmtProfile.o
[758/1719] CXX obj/clang/lib/AST/AST.VTTBuilder.o
[759/1719] CXX obj/clang/lib/AST/AST.StmtPrinter.o
[760/1719] CXX obj/clang/lib/AST/AST.ParentMapContext.o
[761/1719] CXX obj/clang/lib/AST/AST.TypeLoc.o
[762/1719] CXX obj/clang/lib/AST/AST.TypePrinter.o
[763/1719] CXX obj/clang/lib/AST/AST.Type.o
[764/1719] CXX obj/clang/lib/ASTMatchers/Dynamic/Dynamic.Diagnostics.o
[765/1719] CXX obj/clang/lib/AST/AST.VTableBuilder.o
[766/1719] CXX obj/clang/lib/ASTMatchers/Dynamic/Dynamic.Marshallers.o
[767/1719] CXX obj/clang/lib/ASTMatchers/Dynamic/Dynamic.Parser.o
[768/1719] CXX obj/clang/lib/ASTMatchers/ASTMatchers.ASTMatchersInternal.o
[769/1719] CXX obj/clang/lib/ASTMatchers/ASTMatchers.GtestMatchers.o
[770/1719] CXX obj/clang/lib/ASTMatchers/Dynamic/Dynamic.VariantValue.o
[771/1719] CXX obj/clang/lib/AST/AST.TextNodeDumper.o
[772/1719] CXX obj/clang/lib/Analysis/Analysis.BodyFarm.o
[773/1719] CXX obj/clang/lib/Analysis/Analysis.CFGReachabilityAnalysis.o
[774/1719] CXX obj/clang/lib/Analysis/Analysis.CFGStmtMap.o
[775/1719] CXX obj/clang/lib/Analysis/Analysis.AnalysisDeclContext.o
[776/1719] CXX obj/clang/lib/Analysis/Analysis.CallGraph.o
[777/1719] CXX obj/clang/lib/Analysis/Analysis.ConstructionContext.o
[778/1719] CXX obj/clang/lib/Analysis/Analysis.CloneDetection.o
[779/1719] CXX obj/clang/lib/Analysis/Analysis.CalledOnceCheck.o
[780/1719] CXX obj/clang/lib/Analysis/Analysis.CFG.o
[781/1719] CXX obj/clang/lib/Analysis/Analysis.Dominators.o
[782/1719] CXX obj/clang/lib/Analysis/Analysis.Consumed.o
[783/1719] CXX obj/clang/lib/Analysis/Analysis.IssueHash.o
[784/1719] CXX obj/clang/lib/Analysis/Analysis.IntervalPartition.o
[785/1719] CXX obj/clang/lib/Analysis/Analysis.ObjCNoReturn.o
[786/1719] CXX obj/clang/lib/Analysis/Analysis.PostOrderCFGView.o
[787/1719] CXX obj/clang/lib/Analysis/Analysis.ProgramPoint.o
[788/1719] CXX obj/clang/lib/Analysis/Analysis.PathDiagnostic.o
[789/1719] CXX obj/clang/lib/ASTMatchers/ASTMatchers.ASTMatchFinder.o
[790/1719] CXX obj/clang/lib/Analysis/Analysis.LiveVariables.o
[791/1719] CXX obj/clang/lib/Analysis/Analysis.ReachableCode.o
[792/1719] CXX obj/clang/lib/Analysis/Analysis.ThreadSafetyCommon.o
[793/1719] CXX obj/clang/lib/Analysis/Analysis.ExprMutationAnalyzer.o
[794/1719] CXX obj/clang/lib/Analysis/Analysis.RetainSummaryManager.o
[795/1719] CXX obj/clang/lib/Analysis/FlowSensitive/FlowSensitive.ASTOps.o
[796/1719] CXX obj/clang/lib/Analysis/FlowSensitive/FlowSensitive.AdornedCFG.o
[797/1719] CXX obj/clang/lib/Analysis/Analysis.ThreadSafety.o
[798/1719] CXX obj/clang/lib/Analysis/Analysis.UninitializedValues.o
[799/1719] CXX obj/clang/lib/Analysis/FlowSensitive/FlowSensitive.DataflowAnalysisContext.o
[800/1719] CXX obj/clang/lib/Analysis/FlowSensitive/FlowSensitive.Logger.o
[801/1719] CXX obj/clang/lib/Analysis/FlowSensitive/FlowSensitive.RecordOps.o
[802/1719] CXX obj/clang/lib/Analysis/FlowSensitive/FlowSensitive.HTMLLogger.o
[803/1719] CXX obj/clang/lib/Analysis/FlowSensitive/FlowSensitive.DataflowEnvironment.o
[804/1719] CXX obj/clang/lib/Analysis/FlowSensitive/FlowSensitive.SmartPointerAccessorCaching.o
[805/1719] CXX obj/clang/lib/Analysis/FlowSensitive/FlowSensitive.Transfer.o
[806/1719] CXX obj/clang/lib/Analysis/FlowSensitive/Models/Models.ChromiumCheckModel.o
[807/1719] CXX obj/clang/lib/Analysis/FlowSensitive/FlowSensitive.TypeErasedDataflowAnalysis.o
[808/1719] CXX obj/clang/lib/Analysis/Analysis.UnsafeBufferUsage.o
[809/1719] CXX obj/clang/lib/CodeGen/CodeGen.ABIInfo.o
[810/1719] CXX obj/clang/lib/CodeGen/CodeGen.ABIInfoImpl.o
[811/1719] CXX obj/clang/lib/Analysis/FlowSensitive/Models/Models.UncheckedOptionalAccessModel.o
[812/1719] CXX obj/clang/lib/CodeGen/CodeGen.CGAtomic.o
[813/1719] CXX obj/clang/lib/CodeGen/CodeGen.CGBlocks.o
[814/1719] CXX obj/clang/lib/CodeGen/CodeGen.CGCUDARuntime.o
[815/1719] CXX obj/clang/lib/CodeGen/CodeGen.CGCUDANV.o
[816/1719] CXX obj/clang/lib/CodeGen/CodeGen.CGCXX.o
[817/1719] CXX obj/clang/lib/CodeGen/CodeGen.CGCXXABI.o
[818/1719] CXX obj/clang/lib/CodeGen/CodeGen.BackendUtil.o
[819/1719] CXX obj/clang/lib/CodeGen/CodeGen.CGCleanup.o
[820/1719] CXX obj/clang/lib/CodeGen/CodeGen.CGClass.o
[821/1719] CXX obj/clang/lib/CodeGen/CodeGen.CGCoroutine.o
[822/1719] CXX obj/clang/lib/ASTMatchers/Dynamic/Dynamic.Registry.o
[823/1719] CXX obj/clang/lib/CodeGen/CodeGen.CGCall.o
[824/1719] CXX obj/clang/lib/CodeGen/CodeGen.CGDeclCXX.o
[825/1719] CXX obj/clang/lib/CodeGen/CodeGen.CGDecl.o
[826/1719] CXX obj/clang/lib/CodeGen/CodeGen.CGException.o
[827/1719] CXX obj/clang/lib/CodeGen/CodeGen.CGExprAgg.o
[828/1719] CXX obj/clang/lib/CodeGen/CodeGen.CGExprCXX.o
[829/1719] CXX obj/clang/lib/CodeGen/CodeGen.CGExprComplex.o
[830/1719] CXX obj/clang/lib/CodeGen/CodeGen.CGGPUBuiltin.o
[831/1719] CXX obj/clang/lib/CodeGen/CodeGen.CGExprConstant.o
[832/1719] CXX obj/clang/lib/CodeGen/CodeGen.CGExpr.o
[833/1719] CXX obj/clang/lib/CodeGen/CodeGen.CGLoopInfo.o
[834/1719] CXX obj/clang/lib/CodeGen/CodeGen.CGExprScalar.o
[835/1719] CXX obj/clang/lib/CodeGen/CodeGen.CGDebugInfo.o
[836/1719] CXX obj/clang/lib/CodeGen/CodeGen.CGNonTrivialStruct.o
[837/1719] CXX obj/clang/lib/CodeGen/CodeGen.CGObjC.o
[838/1719] CXX obj/clang/lib/CodeGen/CodeGen.CGOpenCLRuntime.o
[839/1719] CXX obj/clang/lib/CodeGen/CodeGen.CGObjCRuntime.o
[840/1719] CXX obj/clang/lib/CodeGen/CodeGen.CGHLSLRuntime.o
[841/1719] CXX obj/clang/lib/CodeGen/CodeGen.CGBuiltin.o
[842/1719] CXX obj/clang/lib/CodeGen/CodeGen.CGObjCGNU.o
[843/1719] CXX obj/clang/lib/CodeGen/CodeGen.CGObjCMac.o
[844/1719] CXX obj/clang/lib/CodeGen/CodeGen.CGOpenMPRuntimeGPU.o
[845/1719] CXX obj/clang/lib/CodeGen/CodeGen.CGPointerAuth.o
[846/1719] CXX obj/clang/lib/CodeGen/CodeGen.CGRecordLayoutBuilder.o
[847/1719] CXX obj/clang/lib/CodeGen/CodeGen.CGVTT.o
[848/1719] CXX obj/clang/lib/CodeGen/CodeGen.CodeGenABITypes.o
[849/1719] CXX obj/clang/lib/CodeGen/CodeGen.CGVTables.o
[850/1719] CXX obj/clang/lib/CodeGen/CodeGen.CGStmt.o
[851/1719] CXX obj/clang/lib/CodeGen/CodeGen.CGOpenMPRuntime.o
[852/1719] CXX obj/clang/lib/CodeGen/CodeGen.ConstantInitBuilder.o
[853/1719] CXX obj/clang/lib/CodeGen/CodeGen.CodeGenAction.o
[854/1719] CXX obj/clang/lib/CodeGen/CodeGen.CGStmtOpenMP.o
[855/1719] CXX obj/clang/lib/CodeGen/CodeGen.CodeGenFunction.o
[856/1719] CXX obj/clang/lib/CodeGen/CodeGen.CodeGenTBAA.o
[857/1719] CXX obj/clang/lib/CodeGen/CodeGen.HLSLBufferLayoutBuilder.o
[858/1719] CXX obj/clang/lib/CodeGen/CodeGen.CodeGenTypes.o
[859/1719] CXX obj/clang/lib/CodeGen/CodeGen.MacroPPCallbacks.o
[860/1719] CXX obj/clang/lib/CodeGen/CodeGen.CoverageMappingGen.o
[861/1719] CXX obj/clang/lib/CodeGen/CodeGen.LinkInModulesPass.o
[862/1719] CXX obj/clang/lib/CodeGen/CodeGen.ModuleBuilder.o
[863/1719] CXX obj/clang/lib/CodeGen/CodeGen.PatternInit.o
[864/1719] CXX obj/clang/lib/CodeGen/CodeGen.CodeGenPGO.o
[865/1719] CXX obj/clang/lib/CodeGen/CodeGen.SanitizerMetadata.o
[866/1719] CXX obj/clang/lib/CodeGen/CodeGen.ItaniumCXXABI.o
[867/1719] CXX obj/clang/lib/CodeGen/CodeGen.MicrosoftCXXABI.o
[868/1719] CXX obj/clang/lib/CodeGen/CodeGen.SwiftCallingConv.o
[869/1719] CXX obj/clang/lib/AST/AST.ASTConcept.o
[870/1719] CXX obj/clang/lib/AST/AST.APValue.o
[871/1719] CXX obj/clang/lib/CodeGen/CodeGen.TargetInfo.o
[872/1719] CXX obj/clang/lib/CodeGen/Targets/CodeGen.AArch64.o
[873/1719] CXX obj/clang/lib/CodeGen/Targets/CodeGen.AMDGPU.o
[874/1719] CXX obj/clang/lib/CodeGen/CodeGen.CodeGenModule.o
[875/1719] CXX obj/clang/lib/CodeGen/Targets/CodeGen.ARC.o
[876/1719] CXX obj/clang/lib/AST/AST.ASTDiagnostic.o
[877/1719] CXX obj/clang/lib/CodeGen/CodeGen.ObjectFilePCHContainerWriter.o
[878/1719] CXX obj/clang/lib/CodeGen/Targets/CodeGen.ARM.o
[879/1719] CXX obj/clang/lib/AST/AST.ASTTypeTraits.o
[880/1719] CXX obj/clang/lib/AST/AST.Availability.o
[881/1719] CXX obj/clang/lib/AST/AST.ASTStructuralEquivalence.o
[882/1719] CXX obj/clang/lib/AST/ByteCode/AST.ByteCodeEmitter.o
[883/1719] CXX obj/clang/lib/AST/ByteCode/AST.Descriptor.o
[884/1719] CXX obj/clang/lib/AST/ByteCode/AST.Context.o
[885/1719] CXX obj/clang/lib/AST/ByteCode/AST.DynamicAllocator.o
[886/1719] CXX obj/clang/lib/AST/AST.ASTDumper.o
[887/1719] CXX obj/clang/lib/AST/AST.ASTImporterLookupTable.o
[888/1719] CXX obj/clang/lib/AST/ByteCode/AST.EvaluationResult.o
[889/1719] CXX obj/clang/lib/AST/ByteCode/AST.Function.o
[890/1719] CXX obj/clang/lib/AST/ByteCode/AST.FunctionPointer.o
[891/1719] CXX obj/clang/lib/AST/AST.ASTContext.o
[892/1719] CXX obj/clang/lib/AST/ByteCode/AST.Compiler.o
[893/1719] CXX obj/clang/lib/AST/ByteCode/AST.InterpBlock.o
[894/1719] CXX obj/clang/lib/AST/AST.ASTImporter.o
[895/1719] CXX obj/clang/lib/AST/ByteCode/AST.InterpStack.o
[896/1719] CXX obj/clang/lib/AST/ByteCode/AST.InterpFrame.o
[897/1719] CXX obj/clang/lib/AST/ByteCode/AST.InterpBuiltinBitCast.o
[898/1719] CXX obj/clang/lib/AST/ByteCode/AST.InterpState.o
[899/1719] CXX obj/clang/lib/AST/ByteCode/AST.MemberPointer.o
[900/1719] CXX obj/clang/lib/AST/ByteCode/AST.PrimType.o
[901/1719] CXX obj/clang/lib/AST/ByteCode/AST.InterpBuiltin.o
[902/1719] CXX obj/clang/lib/AST/ByteCode/AST.Pointer.o
[903/1719] CXX obj/clang/lib/Index/Index.CommentToXML.o
[904/1719] CXX obj/clang/lib/Index/Index.FileIndexRecord.o
[905/1719] CXX obj/clang/lib/AST/AST.AttrImpl.o
[906/1719] CXX obj/clang/lib/Index/Index.IndexSymbol.o
[907/1719] CXX obj/clang/lib/Index/Index.IndexDecl.o
[908/1719] CXX obj/clang/lib/Index/Index.IndexingContext.o
[909/1719] CXX obj/clang/lib/Index/Index.IndexingAction.o
[910/1719] CXX obj/clang/lib/AST/ByteCode/AST.EvalEmitter.o
[911/1719] CXX obj/clang/lib/Index/Index.USRGeneration.o
[912/1719] CXX obj/clang/lib/Index/Index.IndexBody.o
[913/1719] CXX obj/clang/lib/Index/Index.IndexTypeSourceInfo.o
[914/1719] CXX obj/clang/lib/InstallAPI/InstallAPI.Frontend.o
[915/1719] CXX obj/clang/lib/Interpreter/Interpreter.CodeCompletion.o
[916/1719] CXX obj/clang/lib/Interpreter/Interpreter.DeviceOffload.o
[917/1719] CXX obj/clang/lib/AST/ByteCode/AST.Disasm.o
[918/1719] CXX obj/clang/lib/Interpreter/Interpreter.Value.o
[919/1719] CXX obj/clang/lib/Interpreter/Interpreter.IncrementalParser.o
[920/1719] CXX obj/clang/lib/Interpreter/Interpreter.InterpreterUtils.o
[921/1719] CXX obj/clang/lib/Parse/Parse.ParseAST.o
[922/1719] CXX obj/clang/lib/Interpreter/Interpreter.InterpreterValuePrinter.o
[923/1719] CXX obj/clang/lib/InstallAPI/InstallAPI.Visitor.o
[924/1719] CXX obj/clang/lib/Parse/Parse.ParseCXXInlineMethods.o
[925/1719] CXX obj/clang/lib/Interpreter/Interpreter.Interpreter.o
[926/1719] CXX obj/clang/lib/Parse/Parse.ParseExpr.o
[927/1719] CXX obj/clang/lib/Parse/Parse.ParseDeclCXX.o
[928/1719] CXX obj/clang/lib/Parse/Parse.ParseHLSL.o
[929/1719] CXX obj/clang/lib/Parse/Parse.ParseInit.o
[930/1719] CXX obj/clang/lib/Parse/Parse.ParseDecl.o
[931/1719] CXX obj/clang/lib/Parse/Parse.ParseExprCXX.o
[932/1719] CXX obj/clang/lib/Parse/Parse.ParseOpenACC.o
[933/1719] CXX obj/clang/lib/Parse/Parse.ParseObjc.o
[934/1719] CXX obj/clang/lib/AST/ByteCode/AST.Interp.o
[935/1719] AR lib/libclangAST.a
[936/1719] CXX obj/clang/lib/Parse/Parse.ParseOpenMP.o
[937/1719] AR lib/liblldbPluginSymbolFileNativePDB.a
[938/1719] AR lib/libclangIncludeCleaner.a
[939/1719] AR lib/liblldbPluginSymbolFilePDB.a
[940/1719] AR lib/libclangASTMatchers.a
[941/1719] AR lib/libclangInstallAPI.a
[942/1719] AR lib/libclangDynamicASTMatchers.a
[943/1719] AR lib/libclangAnalysis.a
[944/1719] AR lib/libclangAnalysisFlowSensitive.a
[945/1719] AR lib/libclangAnalysisFlowSensitiveModels.a
[946/1719] CXX obj/clang/lib/Parse/Parse.ParseStmt.o
[947/1719] CXX obj/clang/lib/Parse/Parse.ParseTentative.o
[948/1719] CXX obj/clang/lib/Parse/Parse.ParseTemplate.o
[949/1719] CXX obj/clang/lib/Parse/Parse.ParsePragma.o
[950/1719] CXX obj/clang/lib/Parse/Parse.ParseStmtAsm.o
[951/1719] CXX obj/clang/lib/Parse/Parse.Parser.o
[952/1719] CXX obj/clang/lib/Sema/Sema.CheckExprLifetime.o
[953/1719] CXX obj/clang/lib/Sema/Sema.HeuristicResolver.o
[954/1719] CXX obj/clang/lib/Sema/Sema.DelayedDiagnostic.o
[955/1719] CXX obj/clang/lib/Sema/Sema.DeclSpec.o
[956/1719] CXX obj/clang/lib/Sema/Sema.CodeCompleteConsumer.o
[957/1719] CXX obj/clang/lib/Sema/Sema.MultiplexExternalSemaSource.o
[958/1719] CXX obj/clang/lib/Sema/Sema.AnalysisBasedWarnings.o
[959/1719] CXX obj/clang/lib/Sema/Sema.ScopeInfo.o
[960/1719] CXX obj/clang/lib/Sema/Sema.HLSLExternalSemaSource.o
[961/1719] CXX obj/clang/lib/Sema/Sema.JumpDiagnostics.o
[962/1719] CXX obj/clang/lib/Sema/Sema.SemaAMDGPU.o
[963/1719] CXX obj/clang/lib/Sema/Sema.SemaAVR.o
[964/1719] CXX obj/clang/lib/Sema/Sema.SemaAPINotes.o
[965/1719] CXX obj/clang/lib/Sema/Sema.SemaAccess.o
[966/1719] CXX obj/clang/lib/Sema/Sema.ParsedAttr.o
[967/1719] CXX obj/clang/lib/Sema/Sema.SemaAvailability.o
[968/1719] CXX obj/clang/lib/Sema/Sema.SemaAttr.o
[969/1719] CXX obj/clang/lib/CodeGen/Targets/CodeGen.AVR.o
[970/1719] CXX obj/clang/lib/Sema/Sema.Sema.o
[971/1719] CXX obj/clang/lib/Sema/Sema.SemaARM.o
[972/1719] CXX obj/clang/lib/CodeGen/Targets/CodeGen.BPF.o
[973/1719] CXX obj/clang/lib/CodeGen/Targets/CodeGen.CSKY.o
[974/1719] CXX obj/clang/lib/CodeGen/Targets/CodeGen.DirectX.o
[975/1719] CXX obj/clang/lib/CodeGen/Targets/CodeGen.Hexagon.o
[976/1719] CXX obj/clang/lib/CodeGen/Targets/CodeGen.Lanai.o
[977/1719] CXX obj/clang/lib/CodeGen/Targets/CodeGen.LoongArch.o
[978/1719] CXX obj/clang/lib/CodeGen/Targets/CodeGen.M68k.o
[979/1719] CXX obj/clang/lib/CodeGen/Targets/CodeGen.MSP430.o
[980/1719] CXX obj/clang/lib/CodeGen/Targets/CodeGen.Mips.o
[981/1719] CXX obj/clang/lib/CodeGen/Targets/CodeGen.NVPTX.o
[982/1719] CXX obj/clang/lib/CodeGen/Targets/CodeGen.PNaCl.o
[983/1719] CXX obj/clang/lib/CodeGen/Targets/CodeGen.PPC.o
[984/1719] CXX obj/clang/lib/CodeGen/Targets/CodeGen.RISCV.o
[985/1719] CXX obj/clang/lib/CodeGen/Targets/CodeGen.SPIR.o
[986/1719] CXX obj/clang/lib/CodeGen/Targets/CodeGen.Sparc.o
[987/1719] CXX obj/clang/lib/CodeGen/Targets/CodeGen.SystemZ.o
[988/1719] CXX obj/clang/lib/CodeGen/Targets/CodeGen.TCE.o
[989/1719] CXX obj/clang/lib/Edit/Edit.RewriteObjCFoundationAPI.o
[990/1719] AR lib/libclangEdit.a
[991/1719] CXX obj/clang/lib/CodeGen/Targets/CodeGen.VE.o
[992/1719] CXX obj/clang/lib/ExtractAPI/ExtractAPI.API.o
[993/1719] CXX obj/clang/lib/CodeGen/CodeGen.VarBypassDetector.o
[994/1719] CXX obj/clang/lib/CodeGen/Targets/CodeGen.WebAssembly.o
[995/1719] CXX obj/clang/lib/CodeGen/Targets/CodeGen.X86.o
[996/1719] CXX obj/clang/lib/CrossTU/CrossTU.CrossTranslationUnit.o
[997/1719] CXX obj/clang/lib/ExtractAPI/ExtractAPI.TypedefUnderlyingTypeResolver.o
[998/1719] CXX obj/clang/lib/CodeGen/Targets/CodeGen.XCore.o
[999/1719] CXX obj/clang/lib/ExtractAPI/ExtractAPI.DeclarationFragments.o
[1000/1719] CXX obj/clang/lib/ExtractAPI/Serialization/ExtractAPI.SymbolGraphSerializer.o
[1001/1719] CXX obj/clang/lib/Frontend/Frontend.ASTMerge.o
[1002/1719] CXX obj/clang/lib/Frontend/Frontend.CreateInvocationFromCommandLine.o
[1003/1719] CXX obj/clang/lib/Frontend/Frontend.ChainedIncludesSource.o
[1004/1719] CXX obj/clang/lib/Frontend/Frontend.DependencyFile.o
[1005/1719] CXX obj/clang/lib/Frontend/Frontend.ASTUnit.o
[1006/1719] CXX obj/clang/lib/Frontend/Frontend.CompilerInstance.o
[1007/1719] CXX obj/clang/lib/Frontend/Frontend.FrontendAction.o
[1008/1719] CXX obj/clang/lib/Frontend/Frontend.ASTConsumers.o
[1009/1719] CXX obj/clang/lib/Frontend/Frontend.InitPreprocessor.o
[1010/1719] CXX obj/clang/lib/Frontend/Frontend.ModuleDependencyCollector.o
[1011/1719] CXX obj/clang/lib/Frontend/Frontend.FrontendActions.o
[1012/1719] CXX obj/clang/lib/Frontend/Rewrite/Rewrite.HTMLPrint.o
[1013/1719] CXX obj/clang/lib/Frontend/Frontend.TestModuleFileExtension.o
[1014/1719] CXX obj/clang/lib/Frontend/Frontend.PrecompiledPreamble.o
[1015/1719] CXX obj/clang/lib/ExtractAPI/ExtractAPI.ExtractAPIConsumer.o
[1016/1719] CXX obj/clang/lib/Frontend/Rewrite/Rewrite.FrontendActions.o
[1017/1719] CXX obj/clang/lib/Frontend/Frontend.CompilerInvocation.o
[1018/1719] CXX obj/clang/lib/Tooling/Tooling.GuessTargetAndModeCompilationDatabase.o
[1019/1719] CXX obj/clang/lib/FrontendTool/FrontendTool.ExecuteCompilerInvocation.o
[1020/1719] CXX obj/clang/lib/Tooling/Tooling.LocateToolCompilationDatabase.o
[1021/1719] CXX obj/clang/lib/Tooling/Tooling.JSONCompilationDatabase.o
[1022/1719] CXX obj/clang/lib/Frontend/Frontend.InterfaceStubFunctionsConsumer.o
[1023/1719] CXX obj/clang/lib/Frontend/Rewrite/Rewrite.RewriteObjC.o
[1024/1719] CXX obj/clang/lib/Frontend/Rewrite/Rewrite.RewriteModernObjC.o
[1025/1719] CXX obj/clang/lib/Tooling/Tooling.Refactoring.o
[1026/1719] CXX obj/clang/lib/Tooling/Tooling.StandaloneExecution.o
[1027/1719] CXX obj/clang/lib/Tooling/Tooling.RefactoringCallbacks.o
[1028/1719] CXX obj/clang/lib/Tooling/Tooling.Tooling.o
[1029/1719] CXX obj/clang/lib/Tooling/Refactoring/Refactoring.Lookup.o
[1030/1719] CXX obj/clang/lib/Tooling/Refactoring/Extract/Refactoring.Extract.o
[1031/1719] CXX obj/clang/lib/Tooling/DependencyScanning/DependencyScanning.DependencyScanningTool.o
[1032/1719] CXX obj/clang/lib/Tooling/Refactoring/Refactoring.AtomicChange.o
[1033/1719] CXX obj/clang/lib/Tooling/DependencyScanning/DependencyScanning.DependencyScanningWorker.o
[1034/1719] CXX obj/clang/lib/Tooling/DependencyScanning/DependencyScanning.ModuleDepCollector.o
[1035/1719] CXX obj/clang/lib/Tooling/Refactoring/Refactoring.RefactoringActions.o
[1036/1719] CXX obj/clang/lib/Tooling/Refactoring/Rename/Refactoring.RenamingAction.o
[1037/1719] CXX obj/clang/lib/Tooling/ASTDiff/ASTDiff.ASTDiff.o
[1038/1719] AR lib/libclangToolingASTDiff.a
[1039/1719] CXX obj/clang/lib/Tooling/Refactoring/Refactoring.ASTSelection.o
[1040/1719] CXX obj/clang/lib/Tooling/Transformer/Transformer.Parsing.o
[1041/1719] CXX obj/clang/lib/Tooling/Transformer/Transformer.SourceCode.o
[1042/1719] CXX obj/clang/lib/Tooling/Transformer/Transformer.RangeSelector.o
[1043/1719] CXX obj/clang/lib/Tooling/Transformer/Transformer.SourceCodeBuilders.o
[1044/1719] CXX obj/clang/lib/Tooling/Transformer/Transformer.RewriteRule.o
[1045/1719] CXX obj/clang/lib/Tooling/Transformer/Transformer.Stencil.o
[1046/1719] CXX obj/clang/lib/Tooling/Refactoring/Rename/Refactoring.USRFindingAction.o
[1047/1719] CXX obj/clang/lib/Tooling/Transformer/Transformer.Transformer.o
[1048/1719] CXX obj/clang/lib/Tooling/Refactoring/Rename/Refactoring.USRFinder.o
[1049/1719] CXX obj/clang/tools/clang-check/clang-check.ClangCheck.o
[1050/1719] CXX obj/clang/lib/Tooling/Syntax/Syntax.BuildTree.o
[1051/1719] CXX obj/clang/tools/c-index-test/c-index-test.core_main.o
[1052/1719] CXX obj/clang/tools/clang-extdef-mapping/clang-extdef-mapping.ClangExtDefMapGen.o
[1053/1719] CXX obj/clang/tools/clang-diff/clang-diff.ClangDiff.o
[1054/1719] CXX obj/clang/lib/Tooling/Refactoring/Rename/Refactoring.USRLocFinder.o
[1055/1719] CXX obj/clang/tools/clang-refactor/clang-refactor.TestSupport.o
[1056/1719] CXX obj/clang/tools/clang-import-test/clang-import-test.clang-import-test.o
[1057/1719] CXX obj/clang/tools/clang-refactor/clang-refactor.ClangRefactor.o
[1058/1719] CXX obj/clang/tools/clang-installapi/clang-installapi.ClangInstallAPI.o
[1059/1719] CXX obj/clang/tools/diagtool/diagtool.ShowEnabledWarnings.o
[1060/1719] CXX obj/clang/tools/libclang/libclang.CIndexCXX.o
[1061/1719] CXX obj/clang/tools/driver/clang.driver.o
[1062/1719] CXX obj/clang/tools/libclang/libclang.CIndexDiagnostic.o
[1063/1719] CXX obj/clang/tools/driver/clang.cc1_main.o
[1064/1719] CXX obj/clang/tools/libclang/libclang.CIndexUSRs.o
[1065/1719] CXX obj/clang/tools/libclang/libclang.CIndexCodeCompletion.o
[1066/1719] CXX obj/clang/tools/libclang/libclang.CIndexHigh.o
[1067/1719] CXX obj/clang/tools/libclang/libclang.CIndexInclusionStack.o
[1068/1719] CXX obj/clang/tools/libclang/libclang.CXComment.o
[1069/1719] CXX obj/clang/tools/clang-repl/clang-repl.ClangRepl.o
[1070/1719] CXX obj/clang/tools/clang-scan-deps/clang-scan-deps.ClangScanDeps.o
[1071/1719] CXX obj/clang/tools/libclang/libclang.CXCursor.o
[1072/1719] CXX obj/clang/tools/libclang/libclang.CXString.o
[1073/1719] CXX obj/clang/tools/libclang/libclang.CXStoredDiagnostic.o
[1074/1719] CXX obj/clang/tools/libclang/libclang.CXSourceLocation.o
[1075/1719] CXX obj/clang/tools/libclang/libclang.CIndex.o
[1076/1719] CXX obj/clang/tools/libclang/libclang.CXType.o
[1077/1719] CXX obj/clang/tools/libclang/libclang.CXIndexDataConsumer.o
[1078/1719] CXX obj/clang/tools/libclang/libclang.Rewrite.o
[1079/1719] CXX obj/clang/tools/libclang/libclang.Indexing.o
[1080/1719] CXX obj/clang/unittests/AST/ASTTests.ASTExprTest.o
[1081/1719] CXX obj/clang/unittests/AST/ASTTests.ASTImporterFixtures.o
[1082/1719] CXX obj/clang/unittests/AST/ASTTests.ASTContextParentMapTest.o
[1083/1719] CXX obj/clang/unittests/AST/ASTTests.ASTDumperTest.o
[1084/1719] CXX obj/clang/unittests/AST/ASTTests.ASTImporterObjCTest.o
[1085/1719] CXX obj/clang/tools/libclang/libclang.CXExtractAPI.o
[1086/1719] CXX obj/clang/unittests/AST/ASTTests.ASTVectorTest.o
[1087/1719] CXX obj/clang/unittests/AST/ASTTests.AttrTest.o
[1088/1719] CXX obj/clang/unittests/AST/ASTTests.ASTTypeTraitsTest.o
[1089/1719] CXX obj/clang/unittests/AST/ASTTests.ConceptPrinterTest.o
[1090/1719] CXX obj/clang/unittests/AST/ASTTests.DeclBaseTest.o
[1091/1719] CXX obj/clang/unittests/AST/ASTTests.DataCollectionTest.o
[1092/1719] CXX obj/clang/unittests/AST/ASTTests.ASTImporterVisibilityTest.o
[1093/1719] CXX obj/clang/unittests/AST/ASTTests.ASTImporterGenericRedeclTest.o
[1094/1719] CXX obj/clang/unittests/AST/ASTTests.ASTTraverserTest.o
[1095/1719] CXX obj/clang/unittests/AST/ASTTests.EvaluateAsRValueTest.o
[1096/1719] CXX obj/clang/unittests/AST/ASTTests.ExternalASTSourceTest.o
[1097/1719] CXX obj/clang/unittests/AST/ASTTests.ASTImporterODRStrategiesTest.o
[1098/1719] CXX obj/clang/unittests/AST/ASTTests.DeclTest.o
[1099/1719] CXX obj/clang/unittests/AST/ASTTests.DeclPrinterTest.o
[1100/1719] CXX obj/clang/unittests/AST/ASTTests.ProfilingTest.o
[1101/1719] CXX obj/clang/unittests/AST/ASTTests.NamedDeclPrinterTest.o
[1102/1719] CXX obj/clang/unittests/AST/ASTTests.RandstructTest.o
[1103/1719] CXX obj/clang/unittests/AST/ASTTests.RawCommentForDeclTest.o
[1104/1719] CXX obj/clang/unittests/AST/ByteCode/InterpTests.BitcastBuffer.o
[1105/1719] CXX obj/clang/unittests/AST/ASTTests.SizelessTypesTest.o
[1106/1719] CXX obj/clang/unittests/AST/ASTTests.StmtPrinterTest.o
[1107/1719] CXX obj/clang/unittests/AST/ASTTests.TemplateNameTest.o
[1108/1719] CXX obj/clang/unittests/AST/ASTTests.TypePrinterTest.o
[1109/1719] CXX obj/clang/unittests/AST/ByteCode/InterpTests.Descriptor.o
[1110/1719] CXX obj/clang/unittests/AST/ASTTests.SourceLocationTest.o
[1111/1719] CXX obj/clang/unittests/AST/ByteCode/InterpTests.toAPValue.o
[1112/1719] CXX obj/clang/unittests/AST/ASTTests.RecursiveASTVisitorTest.o
[1113/1719] CXX obj/clang/unittests/AST/ASTTests.StructuralEquivalenceTest.o
[1114/1719] CXX obj/clang/unittests/ASTMatchers/ASTMatchersTests.ASTMatchersInternalTest.o
[1115/1719] CXX obj/clang/unittests/ASTMatchers/ASTMatchersTests.GtestMatchersTest.o
[1116/1719] CXX obj/clang/unittests/ASTMatchers/Dynamic/DynamicASTMatchersTests.ParserTest.o
[1117/1719] CXX obj/clang/unittests/ASTMatchers/Dynamic/DynamicASTMatchersTests.RegistryTest.o
[1118/1719] CXX obj/clang/unittests/ASTMatchers/Dynamic/DynamicASTMatchersTests.VariantValueTest.o
[1119/1719] CXX obj/clang/unittests/Analysis/ClangAnalysisTests.CFGTest.o
[1120/1719] CXX obj/clang/unittests/Analysis/ClangAnalysisTests.CFGDominatorTree.o
[1121/1719] CXX obj/clang/unittests/Analysis/ClangAnalysisTests.CloneDetectionTest.o
[1122/1719] CXX obj/clang/unittests/Analysis/ClangAnalysisTests.MacroExpansionContextTest.o
[1123/1719] CXX obj/clang/unittests/AST/ASTTests.ASTImporterTest.o
[1124/1719] CXX obj/clang/unittests/ASTMatchers/ASTMatchersTests.ASTMatchersNodeTest.o
[1125/1719] CXX obj/clang/unittests/Analysis/FlowSensitive/ClangAnalysisFlowSensitiveTests.ASTOpsTest.o
[1126/1719] CXX obj/clang/unittests/Analysis/ClangAnalysisTests.ExprMutationAnalyzerTest.o
[1127/1719] CXX obj/clang/unittests/Analysis/ClangAnalysisTests.IntervalPartitionTest.o
[1128/1719] CXX obj/clang/unittests/Analysis/FlowSensitive/ClangAnalysisFlowSensitiveTests.CFGMatchSwitchTest.o
[1129/1719] CXX obj/clang/unittests/Analysis/FlowSensitive/ClangAnalysisFlowSensitiveTests.DebugSupportTest.o
[1130/1719] CXX obj/clang/unittests/ASTMatchers/ASTMatchersTests.ASTMatchersNarrowingTest.o
[1131/1719] CXX obj/clang/unittests/Analysis/FlowSensitive/ClangAnalysisFlowSensitiveTests.DataflowAnalysisContextTest.o
[1132/1719] CXX obj/clang/unittests/Analysis/FlowSensitive/ClangAnalysisFlowSensitiveTests.DeterminismTest.o
[1133/1719] CXX obj/clang/unittests/Analysis/FlowSensitive/ClangAnalysisFlowSensitiveTests.CachedConstAccessorsLatticeTest.o
[1134/1719] CXX obj/clang/unittests/Analysis/FlowSensitive/ClangAnalysisFlowSensitiveTests.MapLatticeTest.o
[1135/1719] CXX obj/clang/unittests/Analysis/FlowSensitive/ClangAnalysisFlowSensitiveTests.ChromiumCheckModelTest.o
[1136/1719] CXX obj/clang/unittests/Analysis/FlowSensitive/ClangAnalysisFlowSensitiveTests.LoggerTest.o
[1137/1719] CXX obj/clang/unittests/Analysis/FlowSensitive/ClangAnalysisFlowSensitiveTests.DataflowEnvironmentTest.o
[1138/1719] CXX obj/clang/unittests/Analysis/FlowSensitive/ClangAnalysisFlowSensitiveTests.MatchSwitchTest.o
[1139/1719] CXX obj/clang/unittests/Analysis/FlowSensitive/ClangAnalysisFlowSensitiveTests.RecordOpsTest.o
[1140/1719] CXX obj/clang/unittests/ASTMatchers/ASTMatchersTests.ASTMatchersTraversalTest.o
[1141/1719] CXX obj/clang/unittests/StaticAnalyzer/StaticAnalysisTests.ConflictingEvalCallsTest.o
[1142/1719] CXX obj/clang/unittests/StaticAnalyzer/StaticAnalysisTests.ExprEngineVisitTest.o
[1143/1719] CXX obj/clang/lib/Sema/Sema.SemaBPF.o
[1144/1719] CXX obj/clang/lib/Sema/Sema.SemaBase.o
[1145/1719] CXX obj/clang/unittests/Analysis/FlowSensitive/ClangAnalysisFlowSensitiveTests.SmartPointerAccessorCachingTest.o
[1146/1719] CXX obj/clang/lib/Sema/Sema.SemaBoundsSafety.o
[1147/1719] CXX obj/clang/unittests/Analysis/FlowSensitive/ClangAnalysisFlowSensitiveTests.SimplifyConstraintsTest.o
[1148/1719] CXX obj/clang/unittests/Analysis/FlowSensitive/ClangAnalysisFlowSensitiveTests.MultiVarConstantPropagationTest.o
[1149/1719] CXX obj/clang/unittests/Analysis/FlowSensitive/ClangAnalysisFlowSensitiveTests.SignAnalysisTest.o
[1150/1719] CXX obj/clang/unittests/StaticAnalyzer/StaticAnalysisTests.FalsePositiveRefutationBRVisitorTest.o
[1151/1719] CXX obj/clang/lib/Sema/Sema.SemaCUDA.o
[1152/1719] CXX obj/clang/unittests/Analysis/FlowSensitive/ClangAnalysisFlowSensitiveTests.SingleVarConstantPropagationTest.o
[1153/1719] CXX obj/clang/lib/Sema/Sema.SemaCXXScopeSpec.o
[1154/1719] CXX obj/clang/lib/Sema/Sema.SemaCast.o
[1155/1719] CXX obj/clang/lib/Sema/Sema.SemaCoroutine.o
[1156/1719] CXX obj/clang/lib/Sema/Sema.SemaExceptionSpec.o
[1157/1719] CXX obj/clang/lib/Sema/Sema.SemaCodeComplete.o
[1158/1719] CXX obj/clang/lib/Sema/Sema.SemaChecking.o
[1159/1719] CXX obj/clang/lib/Sema/Sema.SemaDeclObjC.o
[1160/1719] CXX obj/clang/lib/Sema/Sema.SemaDeclAttr.o
[1161/1719] CXX obj/clang/lib/Sema/Sema.SemaExprMember.o
[1162/1719] CXX obj/clang/lib/Sema/Sema.SemaConcept.o
[1163/1719] CXX obj/clang/lib/Sema/Sema.SemaFixItUtils.o
[1164/1719] CXX obj/clang/lib/Sema/Sema.SemaFunctionEffects.o
[1165/1719] CXX obj/clang/lib/Sema/Sema.SemaDeclCXX.o
[1166/1719] CXX obj/clang/lib/Sema/Sema.SemaExprObjC.o
[1167/1719] CXX obj/clang/lib/Sema/Sema.SemaDecl.o
[1168/1719] CXX obj/clang/lib/Sema/Sema.SemaHLSL.o
[1169/1719] CXX obj/clang/lib/Sema/Sema.SemaHexagon.o
[1170/1719] CXX obj/clang/lib/Sema/Sema.SemaM68k.o
[1171/1719] CXX obj/clang/lib/Sema/Sema.SemaLoongArch.o
[1172/1719] CXX obj/clang/lib/Sema/Sema.SemaMSP430.o
[1173/1719] CXX obj/clang/lib/Sema/Sema.SemaLambda.o
[1174/1719] CXX obj/clang/lib/Sema/Sema.SemaMIPS.o
[1175/1719] CXX obj/clang/lib/Sema/Sema.SemaInit.o
[1176/1719] CXX obj/clang/lib/Sema/Sema.SemaNVPTX.o
[1177/1719] CXX obj/clang/lib/Sema/Sema.SemaModule.o
[1178/1719] CXX obj/clang/lib/Sema/Sema.SemaOpenACCAtomic.o
[1179/1719] CXX obj/clang/lib/Sema/Sema.SemaLookup.o
[1180/1719] CXX obj/clang/lib/Sema/Sema.SemaOpenACCClause.o
[1181/1719] CXX obj/clang/lib/Sema/Sema.SemaObjC.o
[1182/1719] CXX obj/clang/lib/Sema/Sema.SemaOpenCL.o
[1183/1719] CXX obj/clang/lib/Sema/Sema.SemaExprCXX.o
[1184/1719] CXX obj/clang/lib/Sema/Sema.SemaOpenACC.o
[1185/1719] CXX obj/clang/lib/Sema/Sema.SemaObjCProperty.o
[1186/1719] CXX obj/clang/lib/Sema/Sema.SemaPPC.o
[1187/1719] CXX obj/clang/lib/Sema/Sema.SemaPseudoObject.o
[1188/1719] CXX obj/clang/lib/Sema/Sema.SemaSPIRV.o
[1189/1719] CXX obj/clang/lib/Sema/Sema.SemaRISCV.o
[1190/1719] CXX obj/clang/lib/Sema/Sema.SemaStmtAsm.o
[1191/1719] CXX obj/clang/lib/Sema/Sema.SemaSystemZ.o
[1192/1719] CXX obj/clang/lib/Sema/Sema.SemaSwift.o
[1193/1719] CXX obj/clang/lib/Sema/Sema.SemaStmtAttr.o
[1194/1719] CXX obj/clang/lib/Sema/Sema.SemaExpr.o
[1195/1719] CXX obj/clang/lib/Sema/Sema.SemaOverload.o
[1196/1719] CXX obj/clang/lib/Sema/Sema.SemaStmt.o
[1197/1719] CXX obj/clang/lib/Sema/Sema.SemaWasm.o
[1198/1719] CXX obj/clang/lib/Sema/Sema.SemaSYCL.o
[1199/1719] CXX obj/clang/lib/Sema/Sema.SemaTemplateVariadic.o
[1200/1719] CXX obj/clang/lib/Sema/Sema.TypeLocBuilder.o
[1201/1719] CXX obj/clang/lib/Sema/Sema.SemaX86.o
[1202/1719] CXX obj/clang/lib/Serialization/Serialization.ASTCommon.o
[1203/1719] CXX obj/clang/lib/Sema/Sema.SemaType.o
[1204/1719] CXX obj/clang/lib/Sema/Sema.SemaTemplateDeductionGuide.o
[1205/1719] CXX obj/clang/lib/Sema/Sema.SemaTemplateDeduction.o
[1206/1719] CXX obj/clang/lib/Serialization/Serialization.ASTReaderStmt.o
[1207/1719] CXX obj/clang/lib/Sema/Sema.SemaTemplateInstantiateDecl.o
[1208/1719] CXX obj/clang/lib/Serialization/Serialization.TemplateArgumentHasher.o
[1209/1719] CXX obj/clang/lib/Serialization/Serialization.ASTReaderDecl.o
[1210/1719] CXX obj/clang/lib/Sema/Sema.SemaTemplate.o
[1211/1719] CXX obj/clang/lib/Serialization/Serialization.GeneratePCH.o
[1212/1719] CXX obj/clang/lib/Sema/Sema.SemaTemplateInstantiate.o
[1213/1719] CXX obj/clang/lib/Sema/Sema.SemaOpenMP.o
[1214/1719] AR lib/libclangSema.a
[1215/1719] AR lib/libclangParse.a
[1216/1719] CXX obj/clang/lib/Serialization/Serialization.ASTWriterStmt.o
[1217/1719] CXX obj/clang/lib/Serialization/Serialization.ASTWriterDecl.o
[1218/1719] CXX obj/clang/lib/StaticAnalyzer/Checkers/Checkers.AnalyzerStatsChecker.o
[1219/1719] CXX obj/clang/lib/StaticAnalyzer/Checkers/Checkers.AnalysisOrderChecker.o
[1220/1719] CXX obj/clang/lib/StaticAnalyzer/Checkers/Checkers.AssumeModeling.o
[1221/1719] CXX obj/clang/lib/StaticAnalyzer/Checkers/Checkers.ArrayBoundChecker.o
[1222/1719] CXX obj/clang/lib/StaticAnalyzer/Checkers/Checkers.BitwiseShiftChecker.o
[1223/1719] CXX obj/clang/lib/StaticAnalyzer/Checkers/Checkers.BasicObjCFoundationChecks.o
[1224/1719] CXX obj/clang/lib/StaticAnalyzer/Checkers/Checkers.BoolAssignmentChecker.o
[1225/1719] CXX obj/clang/lib/StaticAnalyzer/Checkers/Checkers.BlockInCriticalSectionChecker.o
[1226/1719] CXX obj/clang/lib/StaticAnalyzer/Checkers/Checkers.BuiltinFunctionChecker.o
[1227/1719] CXX obj/clang/lib/StaticAnalyzer/Checkers/Checkers.CXXDeleteChecker.o
[1228/1719] CXX obj/clang/lib/StaticAnalyzer/Checkers/Checkers.CStringSyntaxChecker.o
[1229/1719] CXX obj/clang/lib/StaticAnalyzer/Checkers/Checkers.CXXSelfAssignmentChecker.o
[1230/1719] CXX obj/clang/lib/Serialization/Serialization.ASTWriter.o
[1231/1719] CXX obj/clang/lib/StaticAnalyzer/Checkers/Checkers.CStringChecker.o
[1232/1719] CXX obj/clang/lib/StaticAnalyzer/Checkers/Checkers.CallAndMessageChecker.o
[1233/1719] CXX obj/clang/lib/StaticAnalyzer/Checkers/Checkers.CastSizeChecker.o
[1234/1719] CXX obj/clang/lib/StaticAnalyzer/Checkers/Checkers.CastToStructChecker.o
[1235/1719] CXX obj/clang/lib/Serialization/Serialization.ASTReader.o
[1236/1719] AR lib/libclangSerialization.a
[1237/1719] AR lib/libclangFrontend.a
[1238/1719] AR lib/libclangQuery.a
[1239/1719] AR lib/libclangIndex.a
[1240/1719] AR lib/libclangReorderFields.a
[1241/1719] AR lib/libclangCodeGen.a
[1242/1719] AR lib/libclangCrossTU.a
[1243/1719] AR lib/libclangExtractAPI.a
[1244/1719] AR lib/libclangRewriteFrontend.a
[1245/1719] CXX obj/clang/lib/StaticAnalyzer/Checkers/Checkers.CheckObjCInstMethSignature.o
[1246/1719] AR lib/liblldbPluginExpressionParserClang.a
[1247/1719] AR lib/liblldbPluginAppleObjCRuntime.a
[1248/1719] AR lib/libclangToolingRefactoring.a
[1249/1719] AR lib/libclangApplyReplacements.a
[1250/1719] AR lib/liblldbPluginObjCLanguage.a
[1251/1719] AR lib/liblldbPluginSymbolFileDWARF.a
[1252/1719] AR lib/liblldbPluginTypeSystemClang.a
[1253/1719] AR lib/liblldbPluginDynamicLoaderMacOSXDYLD.a
[1254/1719] AR lib/liblldbPluginCPlusPlusLanguage.a
[1255/1719] AR lib/liblldbPluginCXXItaniumABI.a
[1256/1719] AR lib/liblldbPluginPlatformPOSIX.a
[1257/1719] AR lib/liblldbPluginPlatformLinux.a
[1258/1719] CXX obj/clang/lib/StaticAnalyzer/Checkers/Checkers.CastValueChecker.o
[1259/1719] STAMP obj/lldb/source/Plugins/LldbAllPlugins.stamp
[1260/1719] CXX obj/clang/lib/StaticAnalyzer/Checkers/Checkers.CheckPlacementNew.o
[1261/1719] LINK ./bin/clang-apply-replacements
[1262/1719] CXX obj/clang/lib/StaticAnalyzer/Checkers/Checkers.CheckObjCDealloc.o
[1263/1719] LINK obj/clang-tools-extra/unittests/clang-apply-replacements/ClangApplyReplacementsTests
[1264/1719] AR lib/libclangToolingSyntax.a
[1265/1719] CXX obj/clang/lib/StaticAnalyzer/Checkers/Checkers.CheckerDocumentation.o
[1266/1719] AR lib/libclangToolingTransformer.a
[1267/1719] CXX obj/clang/lib/StaticAnalyzer/Checkers/Checkers.CheckSecuritySyntaxOnly.o
[1268/1719] CXX obj/clang/lib/StaticAnalyzer/Checkers/Checkers.ChrootChecker.o
[1269/1719] LINK ./bin/diagtool
[1270/1719] LINK ./bin/clang-import-test
[1271/1719] LINK ./bin/lldb-server
[1272/1719] CXX obj/clang/lib/StaticAnalyzer/Checkers/Checkers.CloneChecker.o
[1273/1719] LINK ./bin/lldb-test
[1274/1719] LINK ./bin/lldb
[1275/1719] LINK ./bin/lldb-dap
[1276/1719] CXX obj/clang/lib/StaticAnalyzer/Checkers/Checkers.ContainerModeling.o
[1277/1719] CXX obj/clang/lib/StaticAnalyzer/Checkers/Checkers.ConversionChecker.o
[1278/1719] CXX obj/clang/lib/StaticAnalyzer/Checkers/Checkers.DeadStoresChecker.o
[1279/1719] CXX obj/clang/lib/StaticAnalyzer/Checkers/Checkers.DebugIteratorModeling.o
[1280/1719] CXX obj/clang/lib/StaticAnalyzer/Checkers/Checkers.DereferenceChecker.o
[1281/1719] CXX obj/clang/lib/StaticAnalyzer/Checkers/Checkers.DebugContainerModeling.o
[1282/1719] CXX obj/clang/lib/StaticAnalyzer/Checkers/Checkers.DebugCheckers.o
[1283/1719] CXX obj/clang/lib/StaticAnalyzer/Checkers/Checkers.DynamicTypeChecker.o
[1284/1719] CXX obj/clang/lib/StaticAnalyzer/Checkers/Checkers.DivZeroChecker.o
[1285/1719] CXX obj/clang/lib/StaticAnalyzer/Checkers/Checkers.DirectIvarAssignment.o
[1286/1719] CXX obj/clang/lib/StaticAnalyzer/Checkers/Checkers.DynamicTypePropagation.o
[1287/1719] CXX obj/clang/lib/StaticAnalyzer/Checkers/Checkers.EnumCastOutOfRangeChecker.o
[1288/1719] CXX obj/clang/lib/StaticAnalyzer/Checkers/Checkers.ErrnoChecker.o
[1289/1719] CXX obj/clang/lib/StaticAnalyzer/Checkers/Checkers.ErrnoTesterChecker.o
[1290/1719] CXX obj/clang/lib/StaticAnalyzer/Checkers/Checkers.ErrnoModeling.o
[1291/1719] CXX obj/clang/lib/StaticAnalyzer/Checkers/Checkers.FixedAddressChecker.o
[1292/1719] CXX obj/clang/lib/StaticAnalyzer/Checkers/Checkers.GTestChecker.o
[1293/1719] CXX obj/clang/lib/StaticAnalyzer/Checkers/Checkers.ExprInspectionChecker.o
[1294/1719] CXX obj/clang/lib/StaticAnalyzer/Checkers/Checkers.FuchsiaHandleChecker.o
[1295/1719] CXX obj/clang/lib/StaticAnalyzer/Checkers/Checkers.InnerPointerChecker.o
[1296/1719] CXX obj/clang/lib/StaticAnalyzer/Checkers/Checkers.InvalidatedIteratorChecker.o
[1297/1719] CXX obj/clang/lib/StaticAnalyzer/Checkers/Checkers.GCDAntipatternChecker.o
[1298/1719] CXX obj/clang/lib/StaticAnalyzer/Checkers/Checkers.Iterator.o
[1299/1719] CXX obj/clang/lib/StaticAnalyzer/Checkers/Checkers.IteratorRangeChecker.o
[1300/1719] CXX obj/clang/lib/StaticAnalyzer/Checkers/Checkers.IteratorModeling.o
[1301/1719] CXX obj/clang/lib/StaticAnalyzer/Checkers/Checkers.GenericTaintChecker.o
[1302/1719] CXX obj/clang/lib/StaticAnalyzer/Checkers/Checkers.LLVMConventionsChecker.o
[1303/1719] CXX obj/clang/lib/StaticAnalyzer/Checkers/Checkers.IvarInvalidationChecker.o
[1304/1719] CXX obj/clang/lib/StaticAnalyzer/Checkers/MPI-Checker/Checkers.MPIBugReporter.o
[1305/1719] CXX obj/clang/lib/StaticAnalyzer/Checkers/Checkers.MIGChecker.o
[1306/1719] CXX obj/clang/lib/StaticAnalyzer/Checkers/MPI-Checker/Checkers.MPIFunctionClassifier.o
[1307/1719] CXX obj/clang/lib/StaticAnalyzer/Checkers/MPI-Checker/Checkers.MPIChecker.o
[1308/1719] CXX obj/clang/lib/StaticAnalyzer/Checkers/Checkers.LocalizationChecker.o
[1309/1719] CXX obj/clang/lib/StaticAnalyzer/Checkers/Checkers.MacOSKeychainAPIChecker.o
[1310/1719] CXX obj/clang/lib/StaticAnalyzer/Checkers/Checkers.MacOSXAPIChecker.o
[1311/1719] CXX obj/clang/lib/StaticAnalyzer/Checkers/Checkers.MismatchedIteratorChecker.o
[1312/1719] CXX obj/clang/lib/StaticAnalyzer/Checkers/Checkers.MallocSizeofChecker.o
[1313/1719] CXX obj/clang/lib/StaticAnalyzer/Checkers/Checkers.MmapWriteExecChecker.o
[1314/1719] CXX obj/clang/lib/StaticAnalyzer/Checkers/Checkers.NSAutoreleasePoolChecker.o
[1315/1719] CXX obj/clang/lib/StaticAnalyzer/Checkers/Checkers.MoveChecker.o
[1316/1719] CXX obj/clang/lib/StaticAnalyzer/Checkers/Checkers.NoOwnershipChangeVisitor.o
[1317/1719] CXX obj/clang/lib/StaticAnalyzer/Checkers/Checkers.NSErrorChecker.o
[1318/1719] CXX obj/clang/lib/StaticAnalyzer/Checkers/Checkers.NoReturnFunctionChecker.o
[1319/1719] CXX obj/clang/lib/StaticAnalyzer/Checkers/Checkers.NonNullParamChecker.o
[1320/1719] CXX obj/clang/lib/StaticAnalyzer/Checkers/Checkers.MallocChecker.o
[1321/1719] CXX obj/clang/lib/StaticAnalyzer/Checkers/Checkers.NonnullGlobalConstantsChecker.o
[1322/1719] CXX obj/clang/lib/StaticAnalyzer/Checkers/Checkers.NullabilityChecker.o
[1323/1719] CXX obj/clang/lib/StaticAnalyzer/Checkers/Checkers.ObjCAtSyncChecker.o
[1324/1719] CXX obj/clang/lib/StaticAnalyzer/Checkers/Checkers.ObjCContainersASTChecker.o
[1325/1719] CXX obj/clang/lib/StaticAnalyzer/Checkers/Checkers.OSObjectCStyleCast.o
[1326/1719] CXX obj/clang/lib/StaticAnalyzer/Checkers/Checkers.NumberObjectConversionChecker.o
[1327/1719] CXX obj/clang/lib/StaticAnalyzer/Checkers/Checkers.ObjCContainersChecker.o
[1328/1719] CXX obj/clang/lib/StaticAnalyzer/Checkers/Checkers.ObjCMissingSuperCallChecker.o
[1329/1719] CXX obj/clang/lib/StaticAnalyzer/Checkers/Checkers.ObjCPropertyChecker.o
[1330/1719] CXX obj/clang/lib/StaticAnalyzer/Checkers/Checkers.ObjCAutoreleaseWriteChecker.o
[1331/1719] CXX obj/clang/lib/StaticAnalyzer/Checkers/Checkers.ObjCSelfInitChecker.o
[1332/1719] CXX obj/clang/lib/StaticAnalyzer/Checkers/Checkers.ObjCUnusedIVarsChecker.o
[1333/1719] CXX obj/clang/lib/StaticAnalyzer/Checkers/Checkers.ObjCSuperDeallocChecker.o
[1334/1719] CXX obj/clang/lib/StaticAnalyzer/Checkers/Checkers.PaddingChecker.o
[1335/1719] CXX obj/clang/lib/StaticAnalyzer/Checkers/Checkers.PointerArithChecker.o
[1336/1719] CXX obj/clang/lib/StaticAnalyzer/Checkers/Checkers.PointerSubChecker.o
[1337/1719] CXX obj/clang/lib/StaticAnalyzer/Checkers/Checkers.PutenvStackArrayChecker.o
[1338/1719] CXX obj/clang/lib/StaticAnalyzer/Checkers/Checkers.PthreadLockChecker.o
[1339/1719] CXX obj/clang/lib/StaticAnalyzer/Checkers/Checkers.ReturnPointerRangeChecker.o
[1340/1719] CXX obj/clang/lib/StaticAnalyzer/Checkers/RetainCountChecker/Checkers.RetainCountDiagnostics.o
[1341/1719] CXX obj/clang/lib/StaticAnalyzer/Checkers/RetainCountChecker/Checkers.RetainCountChecker.o
[1342/1719] CXX obj/clang/lib/StaticAnalyzer/Checkers/Checkers.ReturnUndefChecker.o
[1343/1719] CXX obj/clang/lib/StaticAnalyzer/Checkers/Checkers.ReturnValueChecker.o
[1344/1719] CXX obj/clang/lib/StaticAnalyzer/Checkers/Checkers.STLAlgorithmModeling.o
[1345/1719] CXX obj/clang/lib/StaticAnalyzer/Checkers/Checkers.SetgidSetuidOrderChecker.o
[1346/1719] CXX obj/clang/lib/StaticAnalyzer/Checkers/Checkers.SimpleStreamChecker.o
[1347/1719] CXX obj/clang/lib/StaticAnalyzer/Checkers/Checkers.RunLoopAutoreleaseLeakChecker.o
[1348/1719] CXX obj/clang/lib/StaticAnalyzer/Checkers/Checkers.SmartPtrChecker.o
[1349/1719] CXX obj/clang/lib/StaticAnalyzer/Checkers/Checkers.StackAddrEscapeChecker.o
[1350/1719] CXX obj/clang/lib/StaticAnalyzer/Checkers/Checkers.SmartPtrModeling.o
[1351/1719] CXX obj/clang/lib/StaticAnalyzer/Checkers/Checkers.StdVariantChecker.o
[1352/1719] CXX obj/clang/lib/StaticAnalyzer/Checkers/Checkers.StringChecker.o
[1353/1719] CXX obj/clang/lib/StaticAnalyzer/Checkers/Checkers.TaintTesterChecker.o
[1354/1719] CXX obj/clang/lib/StaticAnalyzer/Checkers/Checkers.Taint.o
[1355/1719] CXX obj/clang/lib/StaticAnalyzer/Checkers/Checkers.TraversalChecker.o
[1356/1719] CXX obj/clang/lib/StaticAnalyzer/Checkers/Checkers.TestAfterDivZeroChecker.o
[1357/1719] CXX obj/clang/lib/StaticAnalyzer/Checkers/Checkers.StdLibraryFunctionsChecker.o
[1358/1719] CXX obj/clang/lib/StaticAnalyzer/Checkers/Checkers.TrustNonnullChecker.o
[1359/1719] CXX obj/clang/lib/StaticAnalyzer/Checkers/Checkers.TrustReturnsNonnullChecker.o
[1360/1719] CXX obj/clang/lib/StaticAnalyzer/Checkers/Checkers.StreamChecker.o
[1361/1719] CXX obj/clang/lib/StaticAnalyzer/Checkers/Checkers.UndefBranchChecker.o
[1362/1719] CXX obj/clang/lib/StaticAnalyzer/Checkers/Checkers.UndefCapturedBlockVarChecker.o
[1363/1719] CXX obj/clang/lib/StaticAnalyzer/Checkers/Checkers.UndefResultChecker.o
[1364/1719] CXX obj/clang/lib/StaticAnalyzer/Checkers/Checkers.UndefinedArraySubscriptChecker.o
[1365/1719] CXX obj/clang/lib/StaticAnalyzer/Checkers/Checkers.UndefinedAssignmentChecker.o
[1366/1719] CXX obj/clang/lib/StaticAnalyzer/Checkers/Checkers.UndefinedNewArraySizeChecker.o
[1367/1719] CXX obj/clang/lib/StaticAnalyzer/Checkers/UninitializedObject/Checkers.UninitializedPointee.o
[1368/1719] CXX obj/clang/lib/StaticAnalyzer/Checkers/Checkers.UnixAPIChecker.o
[1369/1719] CXX obj/clang/lib/StaticAnalyzer/Checkers/Checkers.UnreachableCodeChecker.o
[1370/1719] CXX obj/clang/lib/StaticAnalyzer/Checkers/Checkers.VLASizeChecker.o
[1371/1719] CXX obj/clang/lib/StaticAnalyzer/Checkers/UninitializedObject/Checkers.UninitializedObjectChecker.o
[1372/1719] CXX obj/clang/lib/StaticAnalyzer/Checkers/WebKit/Checkers.ASTUtils.o
[1373/1719] CXX obj/clang/lib/StaticAnalyzer/Checkers/Checkers.VforkChecker.o
[1374/1719] CXX obj/clang/lib/StaticAnalyzer/Checkers/Checkers.ValistChecker.o
[1375/1719] CXX obj/clang/lib/StaticAnalyzer/Checkers/Checkers.VirtualCallChecker.o
[1376/1719] CXX obj/clang/lib/StaticAnalyzer/Checkers/WebKit/Checkers.PtrTypesSemantics.o
[1377/1719] CXX obj/clang/lib/StaticAnalyzer/Checkers/WebKit/Checkers.RawPtrRefCallArgsChecker.o
[1378/1719] CXX obj/clang/lib/StaticAnalyzer/Checkers/WebKit/Checkers.RawPtrRefLambdaCapturesChecker.o
[1379/1719] CXX obj/clang/lib/StaticAnalyzer/Checkers/WebKit/Checkers.RawPtrRefMemberChecker.o
[1380/1719] CXX obj/clang/lib/StaticAnalyzer/Checkers/WebKit/Checkers.RawPtrRefLocalVarsChecker.o
[1381/1719] CXX obj/clang/lib/StaticAnalyzer/Checkers/WebKit/Checkers.MemoryUnsafeCastChecker.o
[1382/1719] CXX obj/clang/lib/StaticAnalyzer/Core/Core.AnalysisManager.o
[1383/1719] CXX obj/clang/lib/StaticAnalyzer/Checkers/WebKit/Checkers.RefCntblBaseVirtualDtorChecker.o
[1384/1719] CXX obj/clang/lib/StaticAnalyzer/Checkers/WebKit/Checkers.ForwardDeclChecker.o
[1385/1719] CXX obj/clang/lib/StaticAnalyzer/Checkers/cert/Checkers.InvalidPtrChecker.o
[1386/1719] CXX obj/clang/lib/StaticAnalyzer/Core/Core.AnalyzerOptions.o
[1387/1719] CXX obj/clang/lib/StaticAnalyzer/Core/Core.BasicValueFactory.o
[1388/1719] CXX obj/clang/lib/StaticAnalyzer/Core/Core.BugSuppression.o
[1389/1719] CXX obj/clang/lib/StaticAnalyzer/Core/Core.Checker.o
[1390/1719] CXX obj/clang/lib/StaticAnalyzer/Core/Core.CallDescription.o
[1391/1719] CXX obj/clang/lib/StaticAnalyzer/Core/Core.CheckerHelpers.o
[1392/1719] CXX obj/clang/lib/StaticAnalyzer/Core/Core.CheckerContext.o
[1393/1719] CXX obj/clang/lib/StaticAnalyzer/Core/Core.CallEvent.o
[1394/1719] CXX obj/clang/lib/StaticAnalyzer/Core/Core.BugReporter.o
[1395/1719] CXX obj/clang/lib/StaticAnalyzer/Checkers/WebKit/Checkers.RetainPtrCtorAdoptChecker.o
[1396/1719] CXX obj/clang/lib/StaticAnalyzer/Core/Core.ConstraintManager.o
[1397/1719] CXX obj/clang/lib/StaticAnalyzer/Core/Core.CheckerRegistryData.o
[1398/1719] CXX obj/clang/lib/StaticAnalyzer/Core/Core.CheckerManager.o
[1399/1719] CXX obj/clang/lib/StaticAnalyzer/Core/Core.DynamicExtent.o
[1400/1719] CXX obj/clang/lib/StaticAnalyzer/Core/Core.BugReporterVisitors.o
[1401/1719] CXX obj/clang/lib/StaticAnalyzer/Core/Core.EntryPointStats.o
[1402/1719] CXX obj/clang/lib/StaticAnalyzer/Core/Core.Environment.o
[1403/1719] CXX obj/clang/lib/StaticAnalyzer/Core/Core.CoreEngine.o
[1404/1719] CXX obj/clang/lib/StaticAnalyzer/Core/Core.DynamicType.o
[1405/1719] CXX obj/clang/lib/StaticAnalyzer/Core/Core.ExplodedGraph.o
[1406/1719] CXX obj/clang/lib/StaticAnalyzer/Core/Core.ExprEngineC.o
[1407/1719] CXX obj/clang/lib/StaticAnalyzer/Core/Core.ExprEngineCXX.o
[1408/1719] CXX obj/clang/lib/StaticAnalyzer/Core/Core.ExprEngineCallAndReturn.o
[1409/1719] CXX obj/clang/lib/StaticAnalyzer/Core/Core.HTMLDiagnostics.o
[1410/1719] CXX obj/clang/lib/StaticAnalyzer/Core/Core.ExprEngineObjC.o
[1411/1719] CXX obj/clang/lib/StaticAnalyzer/Core/Core.ExprEngine.o
[1412/1719] CXX obj/clang/lib/StaticAnalyzer/Core/Core.MemRegion.o
[1413/1719] CXX obj/clang/lib/StaticAnalyzer/Core/Core.LoopWidening.o
[1414/1719] CXX obj/clang/lib/StaticAnalyzer/Core/Core.PlistDiagnostics.o
[1415/1719] CXX obj/clang/lib/StaticAnalyzer/Core/Core.ProgramState.o
[1416/1719] CXX obj/clang/lib/StaticAnalyzer/Core/Core.RangedConstraintManager.o
[1417/1719] CXX obj/clang/lib/StaticAnalyzer/Core/Core.LoopUnrolling.o
[1418/1719] CXX obj/clang/lib/StaticAnalyzer/Core/Core.SMTConstraintManager.o
[1419/1719] CXX obj/clang/lib/StaticAnalyzer/Core/Core.SVals.o
[1420/1719] CXX obj/clang/lib/StaticAnalyzer/Core/Core.SarifDiagnostics.o
[1421/1719] CXX obj/clang/lib/StaticAnalyzer/Core/Core.SValBuilder.o
[1422/1719] CXX obj/clang/lib/StaticAnalyzer/Core/Core.RangeConstraintManager.o
[1423/1719] CXX obj/clang/lib/StaticAnalyzer/Core/Core.SimpleConstraintManager.o
[1424/1719] CXX obj/clang/lib/StaticAnalyzer/Core/Core.SymbolManager.o
[1425/1719] CXX obj/clang/lib/StaticAnalyzer/Core/Core.Store.o
[1426/1719] CXX obj/clang/lib/StaticAnalyzer/Core/Core.SimpleSValBuilder.o
[1427/1719] CXX obj/clang/lib/StaticAnalyzer/Core/Core.WorkList.o
[1428/1719] CXX obj/clang/lib/StaticAnalyzer/Core/Core.TextDiagnostics.o
[1429/1719] CXX obj/clang/lib/StaticAnalyzer/Core/Core.RegionStore.o
[1430/1719] CXX obj/clang/lib/StaticAnalyzer/Frontend/Frontend.CheckerRegistry.o
[1431/1719] CXX obj/clang/lib/StaticAnalyzer/Core/Core.Z3CrosscheckVisitor.o
[1432/1719] CXX obj/clang/lib/StaticAnalyzer/Frontend/Frontend.CreateCheckerManager.o
[1433/1719] AR lib/libclangStaticAnalyzerCore.a
[1434/1719] AR lib/libclangStaticAnalyzerCheckers.a
[1435/1719] CXX obj/clang/lib/StaticAnalyzer/Frontend/Frontend.AnalyzerHelpFlags.o
[1436/1719] CXX obj/clang/lib/StaticAnalyzer/Frontend/Frontend.AnalysisConsumer.o
[1437/1719] CXX obj/clang/lib/StaticAnalyzer/Frontend/Frontend.FrontendActions.o
[1438/1719] CXX obj/clang/lib/Testing/Testing.TestAST.o
[1439/1719] AR lib/libclangTesting.a
[1440/1719] CXX obj/clang/lib/Tooling/Tooling.FixIt.o
[1441/1719] CXX obj/clang/lib/StaticAnalyzer/Frontend/Frontend.ModelInjector.o
[1442/1719] AR lib/libclangStaticAnalyzerFrontend.a
[1443/1719] AR lib/libclangFrontendTool.a
[1444/1719] AR lib/libclangInterpreter.a
[1445/1719] CXX obj/clang/lib/Tooling/Tooling.AllTUsExecution.o
[1446/1719] CXX obj/clang/lib/Tooling/Tooling.CommonOptionsParser.o
[1447/1719] CXX obj/clang/lib/Tooling/Tooling.ExpandResponseFilesCompilationDatabase.o
[1448/1719] CXX obj/clang/lib/Tooling/Tooling.Execution.o
[1449/1719] CXX obj/clang/lib/Tooling/Tooling.CompilationDatabase.o
[1450/1719] AR lib/libclangTooling.a
[1451/1719] AR lib/libclangChangeNamespace.a
[1452/1719] LINK ./bin/clang-change-namespace
[1453/1719] AR lib/libclangDoc.a
[1454/1719] LINK ./bin/clang-doc
[1455/1719] LINK ./bin/clang
[1456/1719] AR lib/libclangMove.a
[1457/1719] AR lib/libfindAllSymbols.a
[1458/1719] AR lib/libclangIncludeFixer.a
[1459/1719] LINK ./bin/clang-move
[1460/1719] LINK ./bin/clang-include-fixer
[1461/1719] LINK ./bin/find-all-symbols
[1462/1719] LINK ./bin/clang-query
[1463/1719] AR lib/libclangTidy.a
[1464/1719] LINK ./bin/clang-reorder-fields
[1465/1719] LINK ./bin/modularize
[1466/1719] LINK ./bin/pp-trace
[1467/1719] LINK obj/clang-tools-extra/unittests/clang-change-namespace/ClangChangeNamespaceTests
[1468/1719] CXX obj/clang/unittests/Driver/ClangDriverTests.DXCModeTest.o
[1469/1719] LINK obj/clang-tools-extra/unittests/clang-doc/ClangDocTests
[1470/1719] LINK obj/clang-tools-extra/unittests/clang-move/ClangMoveTests
[1471/1719] LINK obj/clang-tools-extra/unittests/clang-include-fixer/ClangIncludeFixerTests
[1472/1719] AR lib/libclangTidyUtils.a
[1473/1719] AR lib/libclangTidyAndroidModule.a
[1474/1719] AR lib/libclangTidyBoostModule.a
[1475/1719] LINK obj/clang-tools-extra/unittests/clang-include-fixer/find-all-symbols/FindAllSymbolsTests
[1476/1719] AR lib/libclangTidyConcurrencyModule.a
[1477/1719] AR lib/libclangTidyLinuxKernelModule.a
[1478/1719] AR lib/libclangTidyDarwinModule.a
[1479/1719] AR lib/libclangTidyLLVMLibcModule.a
[1480/1719] CXX obj/clang/unittests/Analysis/FlowSensitive/ClangAnalysisFlowSensitiveTests.TestingSupport.o
[1481/1719] AR lib/libclangTidyAbseilModule.a
[1482/1719] AR lib/libclangTidyMiscModule.a
[1483/1719] AR lib/libclangTidyMPIModule.a
[1484/1719] AR lib/libclangTidyAlteraModule.a
[1485/1719] AR lib/libclangTidyObjCModule.a
[1486/1719] AR lib/libclangTidyOpenMPModule.a
[1487/1719] AR lib/libclangTidyPortabilityModule.a
[1488/1719] AR lib/libclangTidyZirconModule.a
[1489/1719] AR lib/libclangTidyPerformanceModule.a
[1490/1719] AR lib/libclangToolingDependencyScanning.a
[1491/1719] LINK obj/clang-tools-extra/unittests/clang-query/ClangQueryTests
[1492/1719] AR lib/libclangTidyReadabilityModule.a
[1493/1719] AR lib/libclangTidyGoogleModule.a
[1494/1719] AR lib/libclangTidyCERTModule.a
[1495/1719] AR lib/libclangTidyFuchsiaModule.a
[1496/1719] LINK ./bin/clang-diff
[1497/1719] AR lib/libclangTidyLLVMModule.a
[1498/1719] CXX obj/clang/unittests/Analysis/FlowSensitive/ClangAnalysisFlowSensitiveTests.TestingSupportTest.o
[1499/1719] AR lib/libclangTidyModernizeModule.a
[1500/1719] AR lib/libclangTidyCppCoreGuidelinesModule.a
[1501/1719] CXX obj/clang/unittests/Analysis/FlowSensitive/ClangAnalysisFlowSensitiveTests.TransferBranchTest.o
[1502/1719] LINK ./bin/clang-extdef-mapping
[1503/1719] AR lib/libclangTidyBugproneModule.a
[1504/1719] AR lib/libclangTidyHICPPModule.a
[1505/1719] STAMP obj/clang-tools-extra/clang-tidy/all-checks.stamp
[1506/1719] LINK ./bin/clang-installapi
[1507/1719] AR lib/libclangDaemon.a
[1508/1719] STAMP obj/clang-tools-extra/clangd/refactor/tweaks/tweaks.stamp
[1509/1719] LINK ./bin/clang-refactor
[1510/1719] LINK ./bin/clang-check
[1511/1719] LINK obj/clang-tools-extra/unittests/clang-tidy/ClangTidyTests
[1512/1719] STAMP obj/clang-tools-extra/unittests/unittests.stamp
[1513/1719] LINK obj/clang-tools-extra/clangd/unittests/xpc/ClangdXpcTests
[1514/1719] LINK ./bin/clang-tidy
[1515/1719] LINK ./bin/dexp
[1516/1719] ACTION //clang/tools/driver:clang-cl(//llvm/utils/gn/build/toolchain:unix)
[1517/1719] STAMP obj/clang/tools/driver/clang-cl.stamp
[1518/1719] LINK ./bin/clangd
[1519/1719] STAMP obj/clang-tools-extra/clangd/xpc/framework/clangxpc_bundle_xpc_service_executable.stamp
[1520/1719] STAMP obj/clang-tools-extra/clangd/xpc/framework/clangd.xpc.inputdeps.stamp
[1521/1719] COPY_BUNDLE_DATA bin/clangd gen/clang-tools-extra/clangd/xpc/framework/clangd.xpc/Contents/MacOS/clangd
[1522/1719] STAMP obj/clang-tools-extra/clangd/xpc/framework/clangd.xpc.stamp
[1523/1719] STAMP obj/clang-tools-extra/clangd/xpc/framework/clangdxpc_bundle_xpc.stamp
[1524/1719] STAMP obj/clang-tools-extra/clangd/xpc/framework/ClangdXPC.framework.inputdeps.stamp
[1525/1719] ACTION //clang/tools/driver:clang-cpp(//llvm/utils/gn/build/toolchain:unix)
[1526/1719] STAMP obj/clang/tools/driver/clang-cpp.stamp
[1527/1719] COPY_BUNDLE_DATA gen/clang-tools-extra/clangd/xpc/framework/clangd.xpc lib/ClangdXPC.framework/Versions/A/XPCServices/clangd.xpc
[1528/1719] LINK ./bin/clangd-indexer
[1529/1719] STAMP obj/clang-tools-extra/clangd/xpc/framework/ClangdXPC.framework.stamp
[1530/1719] ACTION //clang/tools/driver:clangxx(//llvm/utils/gn/build/toolchain:unix)
[1531/1719] STAMP obj/clang/tools/driver/clangxx.stamp
[1532/1719] STAMP obj/clang/tools/driver/symlinks.stamp
[1533/1719] STAMP obj/lldb/test/test.stamp
[1534/1719] STAMP obj/clang.stamp
[1535/1719] STAMP stage2_baremetal_aarch64/obj/compiler-rt/lib/builtins/builtins.inputdeps.stamp
[1536/1719] STAMP stage2_iossim_x64/obj/compiler-rt/lib/builtins/builtins.inputdeps.stamp
[1537/1719] STAMP stage2_unix/obj/compiler-rt/lib/asan/asan_shared_library.inputdeps.stamp
[1538/1719] STAMP stage2_ios_aarch64/obj/compiler-rt/lib/builtins/builtins.inputdeps.stamp
[1539/1719] STAMP stage2_unix/obj/compiler-rt/lib/interception/sources.inputdeps.stamp
[1540/1719] STAMP stage2_unix/obj/compiler-rt/lib/lsan/common_sources.inputdeps.stamp
[1541/1719] LINK obj/clang-tools-extra/clangd/unittests/ClangdTests
[1542/1719] STAMP stage2_unix/obj/compiler-rt/lib/profile/profile.inputdeps.stamp
[1543/1719] STAMP stage2_unix/obj/compiler-rt/lib/sanitizer_common/sources.inputdeps.stamp
[1544/1719] STAMP stage2_unix/obj/compiler-rt/lib/tsan/rtl/rtl.inputdeps.stamp
[1545/1719] STAMP stage2_unix/obj/compiler-rt/lib/ubsan/cxx_sources.inputdeps.stamp
[1546/1719] STAMP stage2_unix/obj/compiler-rt/lib/ubsan/standalone_sources.inputdeps.stamp
[1547/1719] STAMP stage2_unix/obj/compiler-rt/lib/ubsan/sources.inputdeps.stamp
[1548/1719] LINK ./bin/clangd-xpc-test-client
[1549/1719] ACTION //compiler-rt/test:lit_common_configured(//llvm/utils/gn/build/toolchain:stage2_unix)
[1550/1718] ACTION //compiler-rt/test/asan:lit_site_cfg(//llvm/utils/gn/build/toolchain:stage2_unix)
[1551/1715] ACTION //compiler-rt/test/lsan:asan_mode_cfg(//llvm/utils/gn/build/toolchain:stage2_unix)
[1552/1712] STAMP stage2_unix/obj/compiler-rt/lib/builtins/builtins.inputdeps.stamp
[1553/1712] STAMP stage2_unix/obj/libunwind/src/unwind_shared.inputdeps.stamp
[1554/1712] STAMP stage2_unix/obj/libunwind/src/unwind_static_exported.inputdeps.stamp
[1555/1712] STAMP stage2_unix/obj/libunwind/src/unwind_static.inputdeps.stamp
[1556/1712] STAMP obj/clang-tools-extra/clangd/test/test.stamp
[1557/1712] STAMP obj/bolt/test/test.stamp
[1558/1712] LINK ./bin/clang-scan-deps
[1559/1712] LINK ./bin/clang-repl
[1560/1712] LINK obj/clang/unittests/AST/ByteCode/InterpTests
[1561/1712] LINK obj/clang/unittests/Analysis/ClangAnalysisTests
[1562/1712] LINK obj/clang/unittests/ASTMatchers/ASTMatchersTests
[1563/1712] LINK obj/clang/unittests/ASTMatchers/Dynamic/DynamicASTMatchersTests
[1564/1712] LINK obj/clang/unittests/AST/ASTTests
[1565/1712] CXX obj/clang/unittests/Analysis/FlowSensitive/ClangAnalysisFlowSensitiveTests.WatchedLiteralsSolverTest.o
[1566/1712] SOLINK ./lib/libclang.dylib
[1567/1712] LINK obj/clang/unittests/Format/FormatTests
[1568/1712] LINK ./bin/c-index-test
[1569/1712] STAMP obj/clang-tools-extra/test/test.stamp
[1570/1712] CXX obj/clang/unittests/Analysis/FlowSensitive/ClangAnalysisFlowSensitiveTests.UncheckedOptionalAccessModelTest.o
[1571/1712] CXX obj/clang/unittests/CrossTU/CrossTUTests.CrossTranslationUnitTest.o
[1572/1712] CXX obj/clang/unittests/Frontend/FrontendTests.ASTUnitTest.o
[1573/1712] CXX obj/clang/unittests/Driver/ClangDriverTests.ToolChainTest.o
[1574/1712] CXX obj/clang/unittests/CodeGen/ClangCodeGenTests.TBAAMetadataTest.o
[1575/1712] CXX obj/clang/unittests/Frontend/FrontendTests.CompilerInstanceTest.o
[1576/1712] CXX obj/clang/unittests/Frontend/FrontendTests.CodeGenActionTest.o
[1577/1712] LINK obj/clang/unittests/CrossTU/CrossTUTests
[1578/1712] CXX obj/clang/unittests/CodeGen/ClangCodeGenTests.BufferSourceTest.o
[1579/1712] CXX obj/clang/unittests/CodeGen/ClangCodeGenTests.CodeGenExternalTest.o
[1580/1712] LINK obj/clang/unittests/Driver/ClangDriverTests
[1581/1712] LINK obj/clang/unittests/CodeGen/ClangCodeGenTests
[1582/1712] CXX obj/clang/unittests/Analysis/FlowSensitive/ClangAnalysisFlowSensitiveTests.TypeErasedDataflowAnalysisTest.o
[1583/1712] LINK obj/clang/unittests/InstallAPI/InstallAPITests
[1584/1712] CXX obj/clang/unittests/Frontend/FrontendTests.ReparseWorkingDirTest.o
[1585/1712] CXX obj/clang/unittests/Frontend/FrontendTests.PCHPreambleTest.o
[1586/1712] CXX obj/clang/unittests/Frontend/FrontendTests.CompilerInvocationTest.o
[1587/1712] CXX obj/clang/unittests/Frontend/FrontendTests.FrontendActionTest.o
[1588/1712] CXX obj/clang/unittests/Frontend/FrontendTests.OutputStreamTest.o
[1589/1712] CXX obj/clang/unittests/Frontend/FrontendTests.UtilsTest.o
[1590/1712] CXX obj/clang/unittests/Index/IndexTests.IndexTests.o
[1591/1712] LINK obj/clang/unittests/Index/IndexTests
[1592/1712] CXX obj/clang/unittests/Interpreter/ClangReplInterpreterTests.IncrementalCompilerBuilderTest.o
[1593/1712] CXX obj/clang/unittests/Frontend/FrontendTests.NoAlterCodeGenActionTest.o
[1594/1712] CXX obj/clang/unittests/Lex/LexTests.PPCallbacksTest.o
[1595/1712] LINK obj/clang/unittests/Lex/LexTests
[1596/1712] CXX obj/clang/unittests/Interpreter/ExceptionTests/ClangReplInterpreterExceptionTests.InterpreterExceptionTest.o
[1597/1712] LINK obj/clang/unittests/Frontend/FrontendTests
[1598/1712] CXX obj/clang/unittests/Interpreter/ClangReplInterpreterTests.CodeCompletionTest.o
[1599/1712] CXX obj/clang/unittests/Interpreter/ClangReplInterpreterTests.InterpreterExtensionsTest.o
[1600/1712] LINK obj/clang/unittests/Interpreter/ExceptionTests/ClangReplInterpreterExceptionTests
[1601/1712] CXX obj/clang/unittests/Rewrite/RewriteTests.RewriterTest.o
[1602/1712] LINK obj/clang/unittests/Rewrite/RewriteTests
[1603/1712] CXX obj/clang/unittests/Interpreter/ClangReplInterpreterTests.InterpreterTest.o
[1604/1712] CXX obj/clang/unittests/Interpreter/ClangReplInterpreterTests.IncrementalProcessingTest.o
[1605/1712] CXX obj/clang/unittests/Sema/SemaTests.CodeCompleteTest.o
[1606/1712] LINK obj/clang/unittests/Interpreter/ClangReplInterpreterTests
[1607/1712] CXX obj/clang/unittests/Analysis/FlowSensitive/ClangAnalysisFlowSensitiveTests.TransferTest.o
[1608/1712] CXX obj/clang/unittests/Sema/SemaTests.ExternalSemaSourceTest.o
[1609/1712] LINK obj/clang/unittests/Analysis/FlowSensitive/ClangAnalysisFlowSensitiveTests
[1610/1712] CXX obj/clang/unittests/Sema/SemaTests.SemaLookupTest.o
[1611/1712] CXX obj/clang/unittests/Sema/SemaTests.GslOwnerPointerInference.o
[1612/1712] CXX obj/clang/unittests/Serialization/SerializationTests.LoadSpecLazilyTest.o
[1613/1712] CXX obj/clang/unittests/Serialization/SerializationTests.ModuleCacheTest.o
[1614/1712] CXX obj/clang/unittests/Sema/SemaTests.SemaNoloadLookupTest.o
[1615/1712] CXX obj/clang/unittests/Serialization/SerializationTests.ForceCheckFileInputTest.o
[1616/1712] CXX obj/clang/unittests/Serialization/SerializationTests.NoCommentsTest.o
[1617/1712] CXX obj/clang/unittests/StaticAnalyzer/StaticAnalysisTests.AnalyzerOptionsTest.o
[1618/1712] CXX obj/clang/unittests/Serialization/SerializationTests.PreambleInNamedModulesTest.o
[1619/1712] CXX obj/clang/unittests/Sema/SemaTests.HeuristicResolverTest.o
[1620/1712] CXX obj/clang/unittests/StaticAnalyzer/StaticAnalysisTests.APSIntTypeTest.o
[1621/1712] CXX obj/clang/unittests/Serialization/SerializationTests.VarDeclConstantInitTest.o
[1622/1712] LINK obj/clang/unittests/Serialization/SerializationTests
[1623/1712] LINK obj/clang/unittests/Sema/SemaTests
[1624/1712] CXX obj/clang/unittests/StaticAnalyzer/StaticAnalysisTests.CallEventTest.o
[1625/1712] CXX obj/clang/unittests/StaticAnalyzer/StaticAnalysisTests.BugReportInterestingnessTest.o
[1626/1712] CXX obj/clang/unittests/StaticAnalyzer/StaticAnalysisTests.MemRegionDescriptiveNameTest.o
[1627/1712] CXX obj/clang/unittests/StaticAnalyzer/StaticAnalysisTests.ObjcBug-124477.o
[1628/1712] CXX obj/clang/unittests/StaticAnalyzer/StaticAnalysisTests.IsCLibraryFunctionTest.o
[1629/1712] CXX obj/clang/unittests/StaticAnalyzer/StaticAnalysisTests.CallDescriptionTest.o
[1630/1712] CXX obj/clang/unittests/StaticAnalyzer/StaticAnalysisTests.NoStateChangeFuncVisitorTest.o
[1631/1712] CXX obj/clang/unittests/StaticAnalyzer/StaticAnalysisTests.ParamRegionTest.o
[1632/1712] CXX obj/clang/unittests/StaticAnalyzer/StaticAnalysisTests.RegisterCustomCheckersTest.o
[1633/1712] CXX obj/clang/unittests/StaticAnalyzer/StaticAnalysisTests.SValSimplifyerTest.o
[1634/1712] CXX obj/clang/unittests/StaticAnalyzer/StaticAnalysisTests.Z3CrosscheckOracleTest.o
[1635/1712] CXX obj/clang/unittests/Support/ClangSupportTests.TimeProfilerTest.o
[1636/1712] CXX obj/clang/unittests/StaticAnalyzer/StaticAnalysisTests.TestReturnValueUnderConstruction.o
[1637/1712] CXX obj/clang/unittests/StaticAnalyzer/StaticAnalysisTests.SValTest.o
[1638/1712] LINK obj/clang/unittests/Support/ClangSupportTests
[1639/1712] CXX obj/clang/unittests/StaticAnalyzer/StaticAnalysisTests.StoreTest.o
[1640/1712] CXX obj/clang/unittests/StaticAnalyzer/StaticAnalysisTests.SymbolReaperTest.o
[1641/1712] CXX obj/clang/unittests/Tooling/ToolingTests.ASTSelectionTest.o
[1642/1712] CXX obj/clang/unittests/Tooling/ToolingTests.CommentHandlerTest.o
[1643/1712] CXX obj/clang/unittests/Tooling/ToolingTests.CastExprTest.o
[1644/1712] CXX obj/clang/unittests/StaticAnalyzer/StaticAnalysisTests.RangeSetTest.o
[1645/1712] LINK obj/clang/unittests/StaticAnalyzer/StaticAnalysisTests
[1646/1712] CXX obj/clang/unittests/Tooling/ToolingTests.CompilationDatabaseTest.o
[1647/1712] CXX obj/clang/unittests/Tooling/ToolingTests.DiagnosticsYamlTest.o
[1648/1712] CXX obj/clang/unittests/Tooling/ToolingTests.HeaderAnalysisTest.o
[1649/1712] CXX obj/clang/unittests/Tooling/ToolingTests.FixItTest.o
[1650/1712] CXX obj/clang/unittests/Tooling/ToolingTests.ExecutionTest.o
[1651/1712] CXX obj/clang/unittests/Tooling/DependencyScanning/ToolingTests.DependencyScannerTest.o
[1652/1712] CXX obj/clang/unittests/Tooling/ToolingTests.QualTypeNamesTest.o
[1653/1712] CXX obj/clang/unittests/Tooling/ToolingTests.LookupTest.o
[1654/1712] CXX obj/clang/unittests/Tooling/ToolingTests.RecursiveASTVisitorTestDeclVisitor.o
[1655/1712] CXX obj/clang/unittests/Tooling/ToolingTests.RecursiveASTVisitorTestTypeLocVisitor.o
[1656/1712] CXX obj/clang/unittests/Tooling/RecursiveASTVisitorTests/ToolingTests.BitfieldInitializer.o
[1657/1712] CXX obj/clang/unittests/Tooling/RecursiveASTVisitorTests/ToolingTests.CXXBoolLiteralExpr.o
[1658/1712] CXX obj/clang/unittests/Tooling/ToolingTests.LexicallyOrderedRecursiveASTVisitorTest.o
[1659/1712] CXX obj/clang/unittests/Tooling/RecursiveASTVisitorTests/ToolingTests.CXXMemberCall.o
[1660/1712] CXX obj/clang/unittests/Tooling/ToolingTests.RangeSelectorTest.o
[1661/1712] CXX obj/clang/unittests/Tooling/RecursiveASTVisitorTests/ToolingTests.CXXMethodDecl.o
[1662/1712] CXX obj/clang/unittests/Tooling/ToolingTests.RecursiveASTVisitorTestPostOrderVisitor.o
[1663/1712] CXX obj/clang/unittests/Tooling/RecursiveASTVisitorTests/ToolingTests.CXXOperatorCallExprTraverser.o
[1664/1712] CXX obj/clang/unittests/Tooling/RecursiveASTVisitorTests/ToolingTests.Attr.o
[1665/1712] CXX obj/clang/unittests/Tooling/RecursiveASTVisitorTests/ToolingTests.Class.o
[1666/1712] CXX obj/clang/unittests/Tooling/RecursiveASTVisitorTests/ToolingTests.Concept.o
[1667/1712] CXX obj/clang/unittests/Tooling/RecursiveASTVisitorTests/ToolingTests.ConstructExpr.o
[1668/1712] CXX obj/clang/unittests/Tooling/RecursiveASTVisitorTests/ToolingTests.DeclRefExpr.o
[1669/1712] CXX obj/clang/unittests/Tooling/RecursiveASTVisitorTests/ToolingTests.DeductionGuide.o
[1670/1712] CXX obj/clang/unittests/Tooling/RecursiveASTVisitorTests/ToolingTests.ImplicitCtor.o
[1671/1712] CXX obj/clang/unittests/Tooling/RecursiveASTVisitorTests/ToolingTests.ImplicitCtorInitializer.o
[1672/1712] CXX obj/clang/unittests/Tooling/RecursiveASTVisitorTests/ToolingTests.InitListExprPreOrder.o
[1673/1712] CXX obj/clang/unittests/Tooling/RecursiveASTVisitorTests/ToolingTests.InitListExprPreOrderNoQueue.o
[1674/1712] CXX obj/clang/unittests/Tooling/RecursiveASTVisitorTests/ToolingTests.IntegerLiteral.o
[1675/1712] CXX obj/clang/unittests/Tooling/RecursiveASTVisitorTests/ToolingTests.CallbacksBinaryOperator.o
[1676/1712] CXX obj/clang/unittests/Tooling/RecursiveASTVisitorTests/ToolingTests.LambdaDefaultCapture.o
[1677/1712] CXX obj/clang/unittests/Tooling/RecursiveASTVisitorTests/ToolingTests.CallbacksCallExpr.o
[1678/1712] CXX obj/clang/unittests/Tooling/RecursiveASTVisitorTests/ToolingTests.LambdaExpr.o
[1679/1712] CXX obj/clang/unittests/Tooling/RecursiveASTVisitorTests/ToolingTests.InitListExprPostOrder.o
[1680/1712] CXX obj/clang/unittests/Tooling/RecursiveASTVisitorTests/ToolingTests.LambdaTemplateParams.o
[1681/1712] CXX obj/clang/unittests/Tooling/RecursiveASTVisitorTests/ToolingTests.CallbacksUnaryOperator.o
[1682/1712] CXX obj/clang/unittests/Tooling/RecursiveASTVisitorTests/ToolingTests.CallbacksLeaf.o
[1683/1712] CXX obj/clang/unittests/Tooling/RecursiveASTVisitorTests/ToolingTests.CallbacksCompoundAssignOperator.o
[1684/1712] CXX obj/clang/unittests/Tooling/RecursiveASTVisitorTests/ToolingTests.InitListExprPostOrderNoQueue.o
[1685/1712] CXX obj/clang/unittests/Tooling/RecursiveASTVisitorTests/ToolingTests.MemberPointerTypeLoc.o
[1686/1712] CXX obj/clang/unittests/Tooling/RecursiveASTVisitorTests/ToolingTests.NestedNameSpecifiers.o
[1687/1712] CXX obj/clang/unittests/Tooling/RecursiveASTVisitorTests/ToolingTests.ParenExpr.o
[1688/1712] CXX obj/clang/unittests/Tooling/RecursiveASTVisitorTests/ToolingTests.TraversalScope.o
[1689/1712] CXX obj/clang/unittests/Tooling/RecursiveASTVisitorTests/ToolingTests.TemplateArgumentLocTraverser.o
[1690/1712] CXX obj/clang/unittests/Tooling/ToolingTests.ReplacementsYamlTest.o
[1691/1712] CXX obj/clang/unittests/Tooling/ToolingTests.RefactoringActionRulesTest.o
[1692/1712] CXX obj/clang/unittests/Tooling/ToolingTests.RefactoringCallbacksTest.o
[1693/1712] CXX obj/clang/unittests/Tooling/ToolingTests.RefactoringTest.o
[1694/1712] CXX obj/clang/unittests/Tooling/ToolingTests.StandardLibraryTest.o
[1695/1712] CXX obj/clang/unittests/Tooling/ToolingTests.SourceCodeBuildersTest.o
[1696/1712] CXX obj/clang/unittests/Tooling/Syntax/SyntaxTests.SynthesisTest.o
[1697/1712] CXX obj/clang/unittests/Tooling/ToolingTests.ToolingTest.o
[1698/1712] LINK obj/clang/unittests/libclang/libclangTests
[1699/1712] LINK obj/clang/unittests/libclang/CrashTests/libclangCrashTests
[1700/1712] CXX obj/clang/unittests/Tooling/ToolingTests.SourceCodeTest.o
[1701/1712] CXX obj/clang/unittests/Tooling/Syntax/SyntaxTests.TreeTest.o
[1702/1712] CXX obj/clang/unittests/Tooling/Syntax/SyntaxTests.BuildTreeTest.o
[1703/1712] CXX obj/clang/unittests/Tooling/ToolingTests.StencilTest.o
[1704/1712] CXX obj/clang/unittests/Tooling/Syntax/SyntaxTests.MutationsTest.o
[1705/1712] CXX obj/clang/unittests/Tooling/Syntax/SyntaxTests.TreeTestBase.o
[1706/1712] CXX obj/clang/unittests/Tooling/Syntax/SyntaxTests.TokensTest.o
[1707/1712] LINK obj/clang/unittests/Tooling/Syntax/SyntaxTests
[1708/1712] CXX obj/clang/unittests/Tooling/ToolingTests.TransformerTest.o
[1709/1712] LINK obj/clang/unittests/Tooling/ToolingTests
[1710/1712] STAMP obj/clang/unittests/unittests.stamp
[1711/1712] STAMP obj/clang/test/test.stamp
[1712/1712] STAMP obj/default.stamp
INFO:2025-03-20T01:09:57Z:root:analyze
skipping analyze because previous build was not green
INFO:2025-03-20T01:09:57Z:root:testing
INFO:2025-03-20T01:09:57Z:root:test check-clang
ninja: Entering directory `out/gn'
[0/2] ACTION //clang/test:check-clang(//llvm/utils/gn/build/toolchain:unix)
llvm-lit: /Users/thakis/src/llvm-project/llvm/utils/lit/lit/llvm/config.py:520: note: using clang: /Users/thakis/src/llvm-project/out/gn/bin/clang
llvm-lit: /Users/thakis/src/llvm-project/llvm/utils/lit/lit/llvm/subst.py:126: note: Did not find cir-opt in /Users/thakis/src/llvm-project/out/gn/bin:/Users/thakis/src/llvm-project/out/gn/bin
llvm-lit: /Users/thakis/src/llvm-project/llvm/utils/lit/lit/util.py:473: note: using SDKROOT: '/Applications/Xcode.app/Contents/Developer/Platforms/MacOSX.platform/Developer/SDKs/MacOSX13.1.sdk'
llvm-lit: /Users/thakis/src/llvm-project/llvm/utils/lit/lit/llvm/config.py:520: note: using ld.lld: /Users/thakis/src/llvm-project/out/gn/bin/ld.lld
llvm-lit: /Users/thakis/src/llvm-project/llvm/utils/lit/lit/llvm/config.py:520: note: using lld-link: /Users/thakis/src/llvm-project/out/gn/bin/lld-link
llvm-lit: /Users/thakis/src/llvm-project/llvm/utils/lit/lit/llvm/config.py:520: note: using ld64.lld: /Users/thakis/src/llvm-project/out/gn/bin/ld64.lld
llvm-lit: /Users/thakis/src/llvm-project/llvm/utils/lit/lit/llvm/config.py:520: note: using wasm-ld: /Users/thakis/src/llvm-project/out/gn/bin/wasm-ld
-- Testing: 21085 tests, 8 workers --
Testing:  0.. 10.. 20.. 30.. 40.. 50.. 60.. 70.. 80.. 90.. 

Testing Time: 702.75s

Total Discovered Tests: 46841
  Skipped          :    35 (0.07%)
  Unsupported      :   134 (0.29%)
  Passed           : 46638 (99.57%)
  Expectedly Failed:    34 (0.07%)
INFO:2025-03-20T01:22:13Z:root:test check-clang-tools
ninja: Entering directory `out/gn'
[0/2] ACTION //clang-tools-extra/test:check-clang-tools(//llvm/utils/gn/build/toolchain:unix)
llvm-lit: /Users/thakis/src/llvm-project/llvm/utils/lit/lit/llvm/config.py:520: note: using clang: /Users/thakis/src/llvm-project/out/gn/bin/clang
-- Testing: 1004 tests, 8 workers --
Testing:  0.. 10.. 20.. 30.. 40.. 50.. 60.. 70.. 80.. 90.. 

Testing Time: 72.40s

Total Discovered Tests: 1428
  Unsupported      :    3 (0.21%)
  Passed           : 1424 (99.72%)
  Expectedly Failed:    1 (0.07%)
INFO:2025-03-20T01:23:34Z:root:test check-clangd
ninja: Entering directory `out/gn'
[0/2] ACTION //clang-tools-extra/clangd/test:check-clangd(//llvm/utils/gn/build/toolchain:unix)
llvm-lit: /Users/thakis/src/llvm-project/llvm/utils/lit/lit/llvm/config.py:520: note: using clang: /Users/thakis/src/llvm-project/out/gn/bin/clang
-- Testing: 99 tests, 8 workers --
Testing:  0.. 10.. 20.. 30.. 40.. 50.. 60.. 70.. 80.. 90.. 

Testing Time: 18.79s

Total Discovered Tests: 1371
  Unsupported:    7 (0.51%)
  Passed     : 1364 (99.49%)
INFO:2025-03-20T01:23:55Z:root:test check-lld
ninja: Entering directory `out/gn'
[0/2] ACTION //lld/test:check-lld(//llvm/utils/gn/build/toolchain:unix)
llvm-lit: /Users/thakis/src/llvm-project/llvm/utils/lit/lit/llvm/config.py:520: note: using ld.lld: /Users/thakis/src/llvm-project/out/gn/bin/ld.lld
llvm-lit: /Users/thakis/src/llvm-project/llvm/utils/lit/lit/llvm/config.py:520: note: using lld-link: /Users/thakis/src/llvm-project/out/gn/bin/lld-link
llvm-lit: /Users/thakis/src/llvm-project/llvm/utils/lit/lit/llvm/config.py:520: note: using ld64.lld: /Users/thakis/src/llvm-project/out/gn/bin/ld64.lld
llvm-lit: /Users/thakis/src/llvm-project/llvm/utils/lit/lit/llvm/config.py:520: note: using wasm-ld: /Users/thakis/src/llvm-project/out/gn/bin/wasm-ld
-- Testing: 3070 tests, 8 workers --
Testing:  0.. 10.. 20.. 30.. 40.. 50.. 60.. 70.. 80.. 90.. 

Testing Time: 81.47s

Total Discovered Tests: 3070
  Unsupported      :   25 (0.81%)
  Passed           : 3044 (99.15%)
  Expectedly Failed:    1 (0.03%)
INFO:2025-03-20T01:25:18Z:root:test check-llvm
ninja: Entering directory `out/gn'
[0/2] ACTION //llvm/test:check-llvm(//llvm/utils/gn/build/toolchain:unix)
llvm-lit: /Users/thakis/src/llvm-project/llvm/utils/lit/lit/llvm/config.py:520: note: using ld.lld: /Users/thakis/src/llvm-project/out/gn/bin/ld.lld
llvm-lit: /Users/thakis/src/llvm-project/llvm/utils/lit/lit/llvm/config.py:520: note: using lld-link: /Users/thakis/src/llvm-project/out/gn/bin/lld-link
llvm-lit: /Users/thakis/src/llvm-project/llvm/utils/lit/lit/llvm/config.py:520: note: using ld64.lld: /Users/thakis/src/llvm-project/out/gn/bin/ld64.lld
llvm-lit: /Users/thakis/src/llvm-project/llvm/utils/lit/lit/llvm/config.py:520: note: using wasm-ld: /Users/thakis/src/llvm-project/out/gn/bin/wasm-ld
-- Testing: 56520 tests, 8 workers --
Testing: 
FAIL: LLVM :: tools/llvm-ml/strings_errors.asm (1 of 56520)
******************** TEST 'LLVM :: tools/llvm-ml/strings_errors.asm' FAILED ********************
Exit Code: 1

Command Output (stderr):
--
RUN: at line 1: not llvm-ml64 -filetype=s /Users/thakis/src/llvm-project/llvm/test/tools/llvm-ml/strings_errors.asm /Fo /dev/null 2>&1 | /Users/thakis/src/llvm-project/out/gn/bin/FileCheck /Users/thakis/src/llvm-project/llvm/test/tools/llvm-ml/strings_errors.asm --implicit-check-not=error:
+ not llvm-ml64 -filetype=s /Users/thakis/src/llvm-project/llvm/test/tools/llvm-ml/strings_errors.asm /Fo /dev/null
+ /Users/thakis/src/llvm-project/out/gn/bin/FileCheck /Users/thakis/src/llvm-project/llvm/test/tools/llvm-ml/strings_errors.asm --implicit-check-not=error:
/Users/thakis/src/llvm-project/llvm/test/tools/llvm-ml/strings_errors.asm:9:10: error: CHECK: expected string not found in input
; CHECK: error: literal value out of range
         ^
<stdin>:1:1: note: scanning from here
error: unable to find `llvm-ml64' in PATH: No such file or directory
^
<stdin>:1:55: note: possible intended match here
error: unable to find `llvm-ml64' in PATH: No such file or directory
                                                      ^

Input file: <stdin>
Check file: /Users/thakis/src/llvm-project/llvm/test/tools/llvm-ml/strings_errors.asm

-dump-input=help explains the following input dump.

Input was:
<<<<<<
           1: error: unable to find `llvm-ml64' in PATH: No such file or directory 
check:9'0     X~~~~~~~~~~~~~~~~~~~~~~~~~~~~~~~~~~~~~~~~~~~~~~~~~~~~~~~~~~~~~~~~~~~~ error: no match found
check:9'1                                                           ?               possible intended match
>>>>>>

--

********************
Testing: 
FAIL: LLVM :: tools/llvm-ml/dot_operator.asm (2 of 56520)
******************** TEST 'LLVM :: tools/llvm-ml/dot_operator.asm' FAILED ********************
Exit Code: 2

Command Output (stderr):
--
RUN: at line 1: llvm-ml64 -filetype=s /Users/thakis/src/llvm-project/llvm/test/tools/llvm-ml/dot_operator.asm /Fo - | /Users/thakis/src/llvm-project/out/gn/bin/FileCheck /Users/thakis/src/llvm-project/llvm/test/tools/llvm-ml/dot_operator.asm
+ llvm-ml64 -filetype=s /Users/thakis/src/llvm-project/llvm/test/tools/llvm-ml/dot_operator.asm /Fo -
/Users/thakis/src/llvm-project/out/gn/obj/llvm/test/tools/llvm-ml/Output/dot_operator.asm.script: line 1: llvm-ml64: command not found
+ /Users/thakis/src/llvm-project/out/gn/bin/FileCheck /Users/thakis/src/llvm-project/llvm/test/tools/llvm-ml/dot_operator.asm
FileCheck error: '<stdin>' is empty.
FileCheck command line:  /Users/thakis/src/llvm-project/out/gn/bin/FileCheck /Users/thakis/src/llvm-project/llvm/test/tools/llvm-ml/dot_operator.asm

--

********************
Testing: 
FAIL: LLVM :: tools/llvm-ml/proc.asm (3 of 56520)
******************** TEST 'LLVM :: tools/llvm-ml/proc.asm' FAILED ********************
Exit Code: 2

Command Output (stderr):
--
RUN: at line 1: llvm-ml -filetype=s /Users/thakis/src/llvm-project/llvm/test/tools/llvm-ml/proc.asm /Fo - | /Users/thakis/src/llvm-project/out/gn/bin/FileCheck /Users/thakis/src/llvm-project/llvm/test/tools/llvm-ml/proc.asm
+ llvm-ml -filetype=s /Users/thakis/src/llvm-project/llvm/test/tools/llvm-ml/proc.asm /Fo -
+ /Users/thakis/src/llvm-project/out/gn/bin/FileCheck /Users/thakis/src/llvm-project/llvm/test/tools/llvm-ml/proc.asm
RUN: at line 2: llvm-ml64 -filetype=s /Users/thakis/src/llvm-project/llvm/test/tools/llvm-ml/proc.asm /Fo - | /Users/thakis/src/llvm-project/out/gn/bin/FileCheck /Users/thakis/src/llvm-project/llvm/test/tools/llvm-ml/proc.asm
+ llvm-ml64 -filetype=s /Users/thakis/src/llvm-project/llvm/test/tools/llvm-ml/proc.asm /Fo -
/Users/thakis/src/llvm-project/out/gn/obj/llvm/test/tools/llvm-ml/Output/proc.asm.script: line 2: llvm-ml64: command not found
+ /Users/thakis/src/llvm-project/out/gn/bin/FileCheck /Users/thakis/src/llvm-project/llvm/test/tools/llvm-ml/proc.asm
FileCheck error: '<stdin>' is empty.
FileCheck command line:  /Users/thakis/src/llvm-project/out/gn/bin/FileCheck /Users/thakis/src/llvm-project/llvm/test/tools/llvm-ml/proc.asm

--

********************
Testing: 
FAIL: LLVM :: tools/llvm-ml/nested_proc.asm (4 of 56520)
******************** TEST 'LLVM :: tools/llvm-ml/nested_proc.asm' FAILED ********************
Exit Code: 2

Command Output (stderr):
--
RUN: at line 1: llvm-ml -filetype=s /Users/thakis/src/llvm-project/llvm/test/tools/llvm-ml/nested_proc.asm /Fo - | /Users/thakis/src/llvm-project/out/gn/bin/FileCheck /Users/thakis/src/llvm-project/llvm/test/tools/llvm-ml/nested_proc.asm
+ llvm-ml -filetype=s /Users/thakis/src/llvm-project/llvm/test/tools/llvm-ml/nested_proc.asm /Fo -
+ /Users/thakis/src/llvm-project/out/gn/bin/FileCheck /Users/thakis/src/llvm-project/llvm/test/tools/llvm-ml/nested_proc.asm
RUN: at line 2: llvm-ml64 -filetype=s /Users/thakis/src/llvm-project/llvm/test/tools/llvm-ml/nested_proc.asm /Fo - | /Users/thakis/src/llvm-project/out/gn/bin/FileCheck /Users/thakis/src/llvm-project/llvm/test/tools/llvm-ml/nested_proc.asm
+ llvm-ml64 -filetype=s /Users/thakis/src/llvm-project/llvm/test/tools/llvm-ml/nested_proc.asm /Fo -
/Users/thakis/src/llvm-project/out/gn/obj/llvm/test/tools/llvm-ml/Output/nested_proc.asm.script: line 2: llvm-ml64: command not found
+ /Users/thakis/src/llvm-project/out/gn/bin/FileCheck /Users/thakis/src/llvm-project/llvm/test/tools/llvm-ml/nested_proc.asm
FileCheck error: '<stdin>' is empty.
FileCheck command line:  /Users/thakis/src/llvm-project/out/gn/bin/FileCheck /Users/thakis/src/llvm-project/llvm/test/tools/llvm-ml/nested_proc.asm

--

********************
Testing: 
FAIL: LLVM :: tools/llvm-ml/feat00.asm (5 of 56520)
******************** TEST 'LLVM :: tools/llvm-ml/feat00.asm' FAILED ********************
Exit Code: 2

Command Output (stderr):
--
RUN: at line 1: llvm-ml /Users/thakis/src/llvm-project/llvm/test/tools/llvm-ml/feat00.asm /Fo - | /Users/thakis/src/llvm-project/out/gn/bin/llvm-readobj --syms - | /Users/thakis/src/llvm-project/out/gn/bin/FileCheck /Users/thakis/src/llvm-project/llvm/test/tools/llvm-ml/feat00.asm --check-prefix=CHECK-OBJ --check-prefix=CHECK-OBJ-NOSAFESEH
+ llvm-ml /Users/thakis/src/llvm-project/llvm/test/tools/llvm-ml/feat00.asm /Fo -
+ /Users/thakis/src/llvm-project/out/gn/bin/llvm-readobj --syms -
+ /Users/thakis/src/llvm-project/out/gn/bin/FileCheck /Users/thakis/src/llvm-project/llvm/test/tools/llvm-ml/feat00.asm --check-prefix=CHECK-OBJ --check-prefix=CHECK-OBJ-NOSAFESEH
RUN: at line 2: llvm-ml64 /Users/thakis/src/llvm-project/llvm/test/tools/llvm-ml/feat00.asm /Fo - | /Users/thakis/src/llvm-project/out/gn/bin/llvm-readobj --syms - | /Users/thakis/src/llvm-project/out/gn/bin/FileCheck /Users/thakis/src/llvm-project/llvm/test/tools/llvm-ml/feat00.asm --check-prefix=CHECK-OBJ --check-prefix=CHECK-OBJ-NOSAFESEH
+ llvm-ml64 /Users/thakis/src/llvm-project/llvm/test/tools/llvm-ml/feat00.asm /Fo -
/Users/thakis/src/llvm-project/out/gn/obj/llvm/test/tools/llvm-ml/Output/feat00.asm.script: line 2: llvm-ml64: command not found
+ /Users/thakis/src/llvm-project/out/gn/bin/FileCheck /Users/thakis/src/llvm-project/llvm/test/tools/llvm-ml/feat00.asm --check-prefix=CHECK-OBJ --check-prefix=CHECK-OBJ-NOSAFESEH
+ /Users/thakis/src/llvm-project/out/gn/bin/llvm-readobj --syms -
/Users/thakis/src/llvm-project/out/gn/bin/llvm-readobj: error: '<stdin>': The file was not recognized as a valid object file
FileCheck error: '<stdin>' is empty.
FileCheck command line:  /Users/thakis/src/llvm-project/out/gn/bin/FileCheck /Users/thakis/src/llvm-project/llvm/test/tools/llvm-ml/feat00.asm --check-prefix=CHECK-OBJ --check-prefix=CHECK-OBJ-NOSAFESEH

--

********************
Testing: 
FAIL: LLVM :: tools/llvm-ml/extern.asm (6 of 56520)
******************** TEST 'LLVM :: tools/llvm-ml/extern.asm' FAILED ********************
Exit Code: 2

Command Output (stderr):
--
RUN: at line 1: llvm-ml -filetype=s /Users/thakis/src/llvm-project/llvm/test/tools/llvm-ml/extern.asm /Fo - | /Users/thakis/src/llvm-project/out/gn/bin/FileCheck /Users/thakis/src/llvm-project/llvm/test/tools/llvm-ml/extern.asm --check-prefixes=CHECK,CHECK-32
+ llvm-ml -filetype=s /Users/thakis/src/llvm-project/llvm/test/tools/llvm-ml/extern.asm /Fo -
+ /Users/thakis/src/llvm-project/out/gn/bin/FileCheck /Users/thakis/src/llvm-project/llvm/test/tools/llvm-ml/extern.asm --check-prefixes=CHECK,CHECK-32
RUN: at line 2: llvm-ml64 -filetype=s /Users/thakis/src/llvm-project/llvm/test/tools/llvm-ml/extern.asm /Fo - | /Users/thakis/src/llvm-project/out/gn/bin/FileCheck /Users/thakis/src/llvm-project/llvm/test/tools/llvm-ml/extern.asm --check-prefixes=CHECK,CHECK-64
+ llvm-ml64 -filetype=s /Users/thakis/src/llvm-project/llvm/test/tools/llvm-ml/extern.asm /Fo -
/Users/thakis/src/llvm-project/out/gn/obj/llvm/test/tools/llvm-ml/Output/extern.asm.script: line 2: llvm-ml64: command not found
+ /Users/thakis/src/llvm-project/out/gn/bin/FileCheck /Users/thakis/src/llvm-project/llvm/test/tools/llvm-ml/extern.asm --check-prefixes=CHECK,CHECK-64
FileCheck error: '<stdin>' is empty.
FileCheck command line:  /Users/thakis/src/llvm-project/out/gn/bin/FileCheck /Users/thakis/src/llvm-project/llvm/test/tools/llvm-ml/extern.asm --check-prefixes=CHECK,CHECK-64

--

********************
Testing: 
FAIL: LLVM :: tools/llvm-ml/rip_relative_addressing.asm (7 of 56520)
******************** TEST 'LLVM :: tools/llvm-ml/rip_relative_addressing.asm' FAILED ********************
Exit Code: 2

Command Output (stderr):
--
RUN: at line 1: llvm-ml -filetype=s /Users/thakis/src/llvm-project/llvm/test/tools/llvm-ml/rip_relative_addressing.asm /Fo - | /Users/thakis/src/llvm-project/out/gn/bin/FileCheck /Users/thakis/src/llvm-project/llvm/test/tools/llvm-ml/rip_relative_addressing.asm --check-prefixes=CHECK,CHECK-32
+ llvm-ml -filetype=s /Users/thakis/src/llvm-project/llvm/test/tools/llvm-ml/rip_relative_addressing.asm /Fo -
+ /Users/thakis/src/llvm-project/out/gn/bin/FileCheck /Users/thakis/src/llvm-project/llvm/test/tools/llvm-ml/rip_relative_addressing.asm --check-prefixes=CHECK,CHECK-32
RUN: at line 2: llvm-ml64 -filetype=s /Users/thakis/src/llvm-project/llvm/test/tools/llvm-ml/rip_relative_addressing.asm /Fo - | /Users/thakis/src/llvm-project/out/gn/bin/FileCheck /Users/thakis/src/llvm-project/llvm/test/tools/llvm-ml/rip_relative_addressing.asm --check-prefixes=CHECK,CHECK-64
+ llvm-ml64 -filetype=s /Users/thakis/src/llvm-project/llvm/test/tools/llvm-ml/rip_relative_addressing.asm /Fo -
/Users/thakis/src/llvm-project/out/gn/obj/llvm/test/tools/llvm-ml/Output/rip_relative_addressing.asm.script: line 2: llvm-ml64: command not found
+ /Users/thakis/src/llvm-project/out/gn/bin/FileCheck /Users/thakis/src/llvm-project/llvm/test/tools/llvm-ml/rip_relative_addressing.asm --check-prefixes=CHECK,CHECK-64
FileCheck error: '<stdin>' is empty.
FileCheck command line:  /Users/thakis/src/llvm-project/out/gn/bin/FileCheck /Users/thakis/src/llvm-project/llvm/test/tools/llvm-ml/rip_relative_addressing.asm --check-prefixes=CHECK,CHECK-64

--

********************
Testing: 
FAIL: LLVM :: tools/llvm-ml/feat00_override.asm (8 of 56520)
******************** TEST 'LLVM :: tools/llvm-ml/feat00_override.asm' FAILED ********************
Exit Code: 2

Command Output (stderr):
--
RUN: at line 1: llvm-ml /Users/thakis/src/llvm-project/llvm/test/tools/llvm-ml/feat00_override.asm /Fo - | /Users/thakis/src/llvm-project/out/gn/bin/llvm-readobj --syms - | /Users/thakis/src/llvm-project/out/gn/bin/FileCheck /Users/thakis/src/llvm-project/llvm/test/tools/llvm-ml/feat00_override.asm
+ llvm-ml /Users/thakis/src/llvm-project/llvm/test/tools/llvm-ml/feat00_override.asm /Fo -
+ /Users/thakis/src/llvm-project/out/gn/bin/FileCheck /Users/thakis/src/llvm-project/llvm/test/tools/llvm-ml/feat00_override.asm
+ /Users/thakis/src/llvm-project/out/gn/bin/llvm-readobj --syms -
RUN: at line 2: llvm-ml64 /Users/thakis/src/llvm-project/llvm/test/tools/llvm-ml/feat00_override.asm /Fo - | /Users/thakis/src/llvm-project/out/gn/bin/llvm-readobj --syms - | /Users/thakis/src/llvm-project/out/gn/bin/FileCheck /Users/thakis/src/llvm-project/llvm/test/tools/llvm-ml/feat00_override.asm
+ llvm-ml64 /Users/thakis/src/llvm-project/llvm/test/tools/llvm-ml/feat00_override.asm /Fo -
/Users/thakis/src/llvm-project/out/gn/obj/llvm/test/tools/llvm-ml/Output/feat00_override.asm.script: line 2: llvm-ml64: command not found
+ /Users/thakis/src/llvm-project/out/gn/bin/llvm-readobj --syms -
+ /Users/thakis/src/llvm-project/out/gn/bin/FileCheck /Users/thakis/src/llvm-project/llvm/test/tools/llvm-ml/feat00_override.asm
/Users/thakis/src/llvm-project/out/gn/bin/llvm-readobj: error: '<stdin>': The file was not recognized as a valid object file
FileCheck error: '<stdin>' is empty.
FileCheck command line:  /Users/thakis/src/llvm-project/out/gn/bin/FileCheck /Users/thakis/src/llvm-project/llvm/test/tools/llvm-ml/feat00_override.asm

--

********************
Testing: 
FAIL: LLVM :: tools/llvm-ml/proc_frame.asm (9 of 56520)
******************** TEST 'LLVM :: tools/llvm-ml/proc_frame.asm' FAILED ********************
Exit Code: 2

Command Output (stderr):
--
RUN: at line 1: llvm-ml64 -filetype=s /Users/thakis/src/llvm-project/llvm/test/tools/llvm-ml/proc_frame.asm /Fo - | /Users/thakis/src/llvm-project/out/gn/bin/FileCheck /Users/thakis/src/llvm-project/llvm/test/tools/llvm-ml/proc_frame.asm
+ llvm-ml64 -filetype=s /Users/thakis/src/llvm-project/llvm/test/tools/llvm-ml/proc_frame.asm /Fo -
/Users/thakis/src/llvm-project/out/gn/obj/llvm/test/tools/llvm-ml/Output/proc_frame.asm.script: line 1: llvm-ml64: command not found
+ /Users/thakis/src/llvm-project/out/gn/bin/FileCheck /Users/thakis/src/llvm-project/llvm/test/tools/llvm-ml/proc_frame.asm
FileCheck error: '<stdin>' is empty.
FileCheck command line:  /Users/thakis/src/llvm-project/out/gn/bin/FileCheck /Users/thakis/src/llvm-project/llvm/test/tools/llvm-ml/proc_frame.asm

--

********************
Testing: 
FAIL: LLVM :: tools/llvm-ml/architecture_errors.asm (10 of 56520)
******************** TEST 'LLVM :: tools/llvm-ml/architecture_errors.asm' FAILED ********************
Exit Code: 1

Command Output (stderr):
--
RUN: at line 1: not llvm-ml -filetype=s /Users/thakis/src/llvm-project/llvm/test/tools/llvm-ml/architecture_errors.asm /Fo - 2>&1 | /Users/thakis/src/llvm-project/out/gn/bin/FileCheck /Users/thakis/src/llvm-project/llvm/test/tools/llvm-ml/architecture_errors.asm
+ not llvm-ml -filetype=s /Users/thakis/src/llvm-project/llvm/test/tools/llvm-ml/architecture_errors.asm /Fo -
+ /Users/thakis/src/llvm-project/out/gn/bin/FileCheck /Users/thakis/src/llvm-project/llvm/test/tools/llvm-ml/architecture_errors.asm
RUN: at line 2: not llvm-ml -m32 -filetype=s /Users/thakis/src/llvm-project/llvm/test/tools/llvm-ml/architecture_errors.asm /Fo - 2>&1 | /Users/thakis/src/llvm-project/out/gn/bin/FileCheck /Users/thakis/src/llvm-project/llvm/test/tools/llvm-ml/architecture_errors.asm
+ not llvm-ml -m32 -filetype=s /Users/thakis/src/llvm-project/llvm/test/tools/llvm-ml/architecture_errors.asm /Fo -
+ /Users/thakis/src/llvm-project/out/gn/bin/FileCheck /Users/thakis/src/llvm-project/llvm/test/tools/llvm-ml/architecture_errors.asm
RUN: at line 3: not llvm-ml64 -m32 -filetype=s /Users/thakis/src/llvm-project/llvm/test/tools/llvm-ml/architecture_errors.asm /Fo - 2>&1 | /Users/thakis/src/llvm-project/out/gn/bin/FileCheck /Users/thakis/src/llvm-project/llvm/test/tools/llvm-ml/architecture_errors.asm
+ not llvm-ml64 -m32 -filetype=s /Users/thakis/src/llvm-project/llvm/test/tools/llvm-ml/architecture_errors.asm /Fo -
+ /Users/thakis/src/llvm-project/out/gn/bin/FileCheck /Users/thakis/src/llvm-project/llvm/test/tools/llvm-ml/architecture_errors.asm
/Users/thakis/src/llvm-project/llvm/test/tools/llvm-ml/architecture_errors.asm:7:10: error: CHECK: expected string not found in input
; CHECK: :[[# @LINE + 1]]:5: error: register %rax is only available in 64-bit mode
         ^
<stdin>:1:1: note: scanning from here
error: unable to find `llvm-ml64' in PATH: No such file or directory
^
<stdin>:1:1: note: with " @LINE + 1" equal to "8"
error: unable to find `llvm-ml64' in PATH: No such file or directory
^
<stdin>:1:30: note: possible intended match here
error: unable to find `llvm-ml64' in PATH: No such file or directory
                             ^

Input file: <stdin>
Check file: /Users/thakis/src/llvm-project/llvm/test/tools/llvm-ml/architecture_errors.asm

-dump-input=help explains the following input dump.

Input was:
<<<<<<
           1: error: unable to find `llvm-ml64' in PATH: No such file or directory 
check:7'0     X~~~~~~~~~~~~~~~~~~~~~~~~~~~~~~~~~~~~~~~~~~~~~~~~~~~~~~~~~~~~~~~~~~~~ error: no match found
check:7'1                                                                           with " @LINE + 1" equal to "8"
check:7'2                                  ?                                        possible intended match
>>>>>>

--

********************
Testing: 
FAIL: LLVM :: tools/llvm-ml/indirect_branch.asm (11 of 56520)
******************** TEST 'LLVM :: tools/llvm-ml/indirect_branch.asm' FAILED ********************
Exit Code: 2

Command Output (stderr):
--
RUN: at line 1: llvm-ml64 -filetype=s /Users/thakis/src/llvm-project/llvm/test/tools/llvm-ml/indirect_branch.asm /Fo - | /Users/thakis/src/llvm-project/out/gn/bin/FileCheck /Users/thakis/src/llvm-project/llvm/test/tools/llvm-ml/indirect_branch.asm --check-prefixes=CHECK-64,CHECK
+ llvm-ml64 -filetype=s /Users/thakis/src/llvm-project/llvm/test/tools/llvm-ml/indirect_branch.asm /Fo -
+ /Users/thakis/src/llvm-project/out/gn/bin/FileCheck /Users/thakis/src/llvm-project/llvm/test/tools/llvm-ml/indirect_branch.asm --check-prefixes=CHECK-64,CHECK
/Users/thakis/src/llvm-project/out/gn/obj/llvm/test/tools/llvm-ml/Output/indirect_branch.asm.script: line 1: llvm-ml64: command not found
FileCheck error: '<stdin>' is empty.
FileCheck command line:  /Users/thakis/src/llvm-project/out/gn/bin/FileCheck /Users/thakis/src/llvm-project/llvm/test/tools/llvm-ml/indirect_branch.asm --check-prefixes=CHECK-64,CHECK

--

********************
Testing: 
FAIL: LLVM :: tools/llvm-ml/architecture.asm (12 of 56520)
******************** TEST 'LLVM :: tools/llvm-ml/architecture.asm' FAILED ********************
Exit Code: 2

Command Output (stderr):
--
RUN: at line 1: llvm-ml64 -filetype=s /Users/thakis/src/llvm-project/llvm/test/tools/llvm-ml/architecture.asm /Fo - | /Users/thakis/src/llvm-project/out/gn/bin/FileCheck /Users/thakis/src/llvm-project/llvm/test/tools/llvm-ml/architecture.asm --implicit-check-not=error:
+ llvm-ml64 -filetype=s /Users/thakis/src/llvm-project/llvm/test/tools/llvm-ml/architecture.asm /Fo -
/Users/thakis/src/llvm-project/out/gn/obj/llvm/test/tools/llvm-ml/Output/architecture.asm.script: line 1: llvm-ml64: command not found
+ /Users/thakis/src/llvm-project/out/gn/bin/FileCheck /Users/thakis/src/llvm-project/llvm/test/tools/llvm-ml/architecture.asm --implicit-check-not=error:
FileCheck error: '<stdin>' is empty.
FileCheck command line:  /Users/thakis/src/llvm-project/out/gn/bin/FileCheck /Users/thakis/src/llvm-project/llvm/test/tools/llvm-ml/architecture.asm --implicit-check-not=error:

--

********************
Testing: 
FAIL: LLVM :: tools/llvm-ml/macro.asm (13 of 56520)
******************** TEST 'LLVM :: tools/llvm-ml/macro.asm' FAILED ********************
Exit Code: 2

Command Output (stderr):
--
RUN: at line 1: llvm-ml64 -filetype=s /Users/thakis/src/llvm-project/llvm/test/tools/llvm-ml/macro.asm /Fo - | /Users/thakis/src/llvm-project/out/gn/bin/FileCheck /Users/thakis/src/llvm-project/llvm/test/tools/llvm-ml/macro.asm
+ llvm-ml64 -filetype=s /Users/thakis/src/llvm-project/llvm/test/tools/llvm-ml/macro.asm /Fo -
/Users/thakis/src/llvm-project/out/gn/obj/llvm/test/tools/llvm-ml/Output/macro.asm.script: line 1: llvm-ml64: command not found
+ /Users/thakis/src/llvm-project/out/gn/bin/FileCheck /Users/thakis/src/llvm-project/llvm/test/tools/llvm-ml/macro.asm
FileCheck error: '<stdin>' is empty.
FileCheck command line:  /Users/thakis/src/llvm-project/out/gn/bin/FileCheck /Users/thakis/src/llvm-project/llvm/test/tools/llvm-ml/macro.asm

--

********************
Testing: 
FAIL: LLVM :: tools/llvm-ml/repeat_directives.asm (14 of 56520)
******************** TEST 'LLVM :: tools/llvm-ml/repeat_directives.asm' FAILED ********************
Exit Code: 2

Command Output (stderr):
--
RUN: at line 1: llvm-ml64 -filetype=s /Users/thakis/src/llvm-project/llvm/test/tools/llvm-ml/repeat_directives.asm /Fo - | /Users/thakis/src/llvm-project/out/gn/bin/FileCheck /Users/thakis/src/llvm-project/llvm/test/tools/llvm-ml/repeat_directives.asm
+ llvm-ml64 -filetype=s /Users/thakis/src/llvm-project/llvm/test/tools/llvm-ml/repeat_directives.asm /Fo -
/Users/thakis/src/llvm-project/out/gn/obj/llvm/test/tools/llvm-ml/Output/repeat_directives.asm.script: line 1: llvm-ml64: command not found
+ /Users/thakis/src/llvm-project/out/gn/bin/FileCheck /Users/thakis/src/llvm-project/llvm/test/tools/llvm-ml/repeat_directives.asm
FileCheck error: '<stdin>' is empty.
FileCheck command line:  /Users/thakis/src/llvm-project/out/gn/bin/FileCheck /Users/thakis/src/llvm-project/llvm/test/tools/llvm-ml/repeat_directives.asm

--

********************
Testing: 
FAIL: LLVM :: tools/llvm-ml/struct.asm (15 of 56520)
******************** TEST 'LLVM :: tools/llvm-ml/struct.asm' FAILED ********************
Exit Code: 2

Command Output (stderr):
--
RUN: at line 1: llvm-ml64 -filetype=s /Users/thakis/src/llvm-project/llvm/test/tools/llvm-ml/struct.asm /Fo - | /Users/thakis/src/llvm-project/out/gn/bin/FileCheck /Users/thakis/src/llvm-project/llvm/test/tools/llvm-ml/struct.asm
+ llvm-ml64 -filetype=s /Users/thakis/src/llvm-project/llvm/test/tools/llvm-ml/struct.asm /Fo -
/Users/thakis/src/llvm-project/out/gn/obj/llvm/test/tools/llvm-ml/Output/struct.asm.script: line 1: llvm-ml64: command not found
+ /Users/thakis/src/llvm-project/out/gn/bin/FileCheck /Users/thakis/src/llvm-project/llvm/test/tools/llvm-ml/struct.asm
FileCheck error: '<stdin>' is empty.
FileCheck command line:  /Users/thakis/src/llvm-project/out/gn/bin/FileCheck /Users/thakis/src/llvm-project/llvm/test/tools/llvm-ml/struct.asm

--

********************
Testing:  0.. 10.. 20.. 30.. 40.. 50.. 60.. 70.. 80.. 90..
********************
Failed Tests (15):
  LLVM :: tools/llvm-ml/architecture.asm
  LLVM :: tools/llvm-ml/architecture_errors.asm
  LLVM :: tools/llvm-ml/dot_operator.asm
  LLVM :: tools/llvm-ml/extern.asm
  LLVM :: tools/llvm-ml/feat00.asm
  LLVM :: tools/llvm-ml/feat00_override.asm
  LLVM :: tools/llvm-ml/indirect_branch.asm
  LLVM :: tools/llvm-ml/macro.asm
  LLVM :: tools/llvm-ml/nested_proc.asm
  LLVM :: tools/llvm-ml/proc.asm
  LLVM :: tools/llvm-ml/proc_frame.asm
  LLVM :: tools/llvm-ml/repeat_directives.asm
  LLVM :: tools/llvm-ml/rip_relative_addressing.asm
  LLVM :: tools/llvm-ml/strings_errors.asm
  LLVM :: tools/llvm-ml/struct.asm


Testing Time: 787.85s

Total Discovered Tests: 64599
  Skipped          :    32 (0.05%)
  Unsupported      :  2340 (3.62%)
  Passed           : 62035 (96.03%)
  Expectedly Failed:   177 (0.27%)
  Failed           :    15 (0.02%)
FAILED: gen/llvm/test/run-lit 
python3 bin/llvm-lit -sv ../../llvm/test
ninja: build stopped: subcommand failed.
Command '['ninja', '-C', 'out/gn', 'check-llvm']' returned non-zero exit status 1.