INFO:2025-03-20T07:13:52Z:root:pulling...
From https://github.com/llvm/llvm-project
 * branch                      main       -> FETCH_HEAD
   9cdbc47144f2..7c6479021382  main       -> origin/main
Switched to branch 'main'
Your branch is behind 'origin/main' by 4 commits, and can be fast-forwarded.
  (use "git pull" to update your local branch)
HEAD is now at 7c6479021382 [CIR] Follow up for addressing style comment (#132093)
INFO:2025-03-20T07:13:58Z:root:syncing...
Deleted branch merge (was e889799ec64d).
Switched to a new branch 'merge'
branch 'merge' set up to track 'origin/main'.
[merge 40be6705fd3f] [gn build] Port 08dda4dcbf64
 2 files changed, 2 insertions(+)
[gn build] Port 08dda4dcbf64 -- https://github.com/llvm/llvm-project/commit/08dda4dcbf64
INFO:2025-03-20T07:13:59Z:root:building
ninja: Entering directory `out/gn'
[0/1] Regenerating ninja files
[1/161] CXX obj/llvm/tools/llc/llc.NewPMDriver.o
[2/161] CXX obj/llvm/lib/Target/AArch64/GISel/LLVMAArch64CodeGen.AArch64LegalizerInfo.o
[3/161] AR lib/libLLVMAArch64CodeGen.a
[4/161] STAMP obj/llvm/lib/Target/AArch64/AArch64.stamp
[5/161] STAMP obj/llvm/lib/Target/AllTargetsCodeGens.stamp
[6/161] STAMP obj/llvm/lib/Target/NativeTarget.stamp
[7/161] STAMP obj/llvm/lib/Target/TargetsToBuild.stamp
[8/161] LINK obj/llvm/unittests/Target/AArch64/AArch64Tests
[9/161] LINK obj/llvm/unittests/tools/llvm-exegesis/AArch64/LLVMExegesisAArch64Tests
[10/161] LINK ./bin/lli
[11/161] LINK obj/llvm/unittests/ExecutionEngine/Orc/OrcJITTests
[12/161] LINK obj/llvm/unittests/ExecutionEngine/MCJIT/MCJITTests
[13/161] LINK ./bin/clang-offload-packager
[14/161] LINK ./bin/llvm-exegesis
[15/161] LINK ./bin/llvm-split
[16/161] LINK obj/llvm/unittests/Target/TargetMachineCTests
[17/161] LINK ./bin/llvm-dwarfutil
[18/161] LINK obj/clang/unittests/CrossTU/CrossTUTests
[19/161] LINK ./bin/clang-linker-wrapper
[20/161] LINK ./bin/clang-nvlink-wrapper
[21/161] LINK ./bin/clang-scan-deps
[22/161] LINK obj/clang/unittests/Driver/ClangDriverTests
[23/161] LINK obj/clang/unittests/Tooling/Syntax/SyntaxTests
[24/161] LINK ./bin/clang-check
[25/161] LINK ./bin/lld
[26/161] ACTION //lld/tools/lld:ld.lld(//llvm/utils/gn/build/toolchain:unix)
[27/161] LINK obj/lld/unittests/AsLibAll/LLDAsLibAllTests
[28/161] STAMP obj/lld/tools/lld/ld.lld.stamp
[29/161] ACTION //lld/tools/lld:ld64.lld(//llvm/utils/gn/build/toolchain:unix)
[30/161] ACTION //lld/tools/lld:lld-link(//llvm/utils/gn/build/toolchain:unix)
[31/161] STAMP obj/lld/tools/lld/ld64.lld.stamp
[32/161] STAMP obj/lld/tools/lld/lld-link.stamp
[33/161] ACTION //lld/tools/lld:wasm-ld(//llvm/utils/gn/build/toolchain:unix)
[34/161] STAMP obj/lld/tools/lld/wasm-ld.stamp
[35/161] STAMP obj/lld/tools/lld/symlinks.stamp
[36/161] SOLINK ./lib/libclang.dylib
[37/161] LINK obj/clang/unittests/Interpreter/ExceptionTests/ClangReplInterpreterExceptionTests
[38/161] LINK obj/clang/unittests/libclang/libclangTests
[39/161] LINK obj/lld/unittests/AsLibELF/LLDAsLibELFTests
[40/161] STAMP obj/lld/unittests/unittests.stamp
[41/161] LINK ./bin/clang-repl
[42/161] LINK obj/clang/unittests/libclang/CrashTests/libclangCrashTests
[43/161] LINK obj/clang/unittests/Tooling/ToolingTests
[44/161] LINK ./bin/clang
[45/161] LINK obj/clang/unittests/Interpreter/ClangReplInterpreterTests
[46/161] ACTION //clang/tools/driver:clang-cl(//llvm/utils/gn/build/toolchain:unix)
[47/161] STAMP obj/clang/tools/driver/clang-cl.stamp
[48/161] ACTION //clang/tools/driver:clang-cpp(//llvm/utils/gn/build/toolchain:unix)
[49/161] ACTION //clang/tools/driver:clangxx(//llvm/utils/gn/build/toolchain:unix)
[50/161] STAMP obj/clang/tools/driver/clang-cpp.stamp
[51/161] LINK ./bin/c-index-test
[52/161] STAMP obj/clang/tools/driver/clangxx.stamp
[53/161] STAMP obj/clang/unittests/unittests.stamp
[54/161] STAMP obj/clang/tools/driver/symlinks.stamp
[55/161] LINK ./bin/llvm-jitlink
[56/161] LINK ./bin/llvm-gsymutil
[57/161] LINK ./bin/llvm-dwp
[58/161] LINK ./bin/llvm-ar
[59/161] LINK ./bin/llvm-isel-fuzzer
[60/161] ACTION //llvm/tools/llvm-ar:llvm-dlltool(//llvm/utils/gn/build/toolchain:unix)
[61/161] ACTION //llvm/tools/llvm-ar:llvm-lib(//llvm/utils/gn/build/toolchain:unix)
[62/161] STAMP obj/llvm/tools/llvm-ar/llvm-dlltool.stamp
[63/161] LINK ./bin/llvm-cxxdump
[64/161] STAMP obj/llvm/tools/llvm-ar/llvm-lib.stamp
[65/161] ACTION //llvm/tools/llvm-ar:llvm-ranlib(//llvm/utils/gn/build/toolchain:unix)
[66/161] STAMP obj/llvm/tools/llvm-ar/llvm-ranlib.stamp
[67/161] STAMP obj/llvm/tools/llvm-ar/symlinks.stamp
[68/161] LINK ./bin/llvm-cxxmap
[69/161] LINK ./bin/llc
[70/161] LINK ./bin/dsymutil
[71/161] LINK ./bin/llvm-rtdyld
[72/161] LINK ./bin/lldb
[73/161] LINK ./bin/bugpoint
[74/161] LINK ./bin/llvm-libtool-darwin
[75/161] LINK ./bin/lldb-dap
[76/161] STAMP obj/llvm/tools/llvm-libtool-darwin/symlinks.stamp
[77/161] STAMP obj/clang-tools-extra/test/test.stamp
[78/161] LINK ./bin/llvm-lipo
[79/161] LINK ./bin/lldb-test
[80/161] STAMP obj/llvm/tools/llvm-lipo/symlinks.stamp
[81/161] LINK ./bin/llvm-ml
[82/161] LINK ./bin/llvm-mc
[83/161] STAMP obj/lldb/test/test.stamp
[84/161] LINK ./bin/llvm-c-test
[85/161] LINK ./bin/llvm-reduce
[86/161] STAMP obj/clang.stamp
[87/161] STAMP obj/lld.stamp
[88/161] STAMP obj/llvm-ar.stamp
[89/161] LINK ./bin/llvm-lto2
[90/161] LINK obj/clang-tools-extra/clangd/unittests/xpc/ClangdXpcTests
[91/161] LINK ./bin/llvm-lto
[92/161] STAMP stage2_unix/obj/compiler-rt/lib/asan/asan_shared_library.inputdeps.stamp
[93/161] LINK ./bin/llvm-opt-fuzzer
[94/161] STAMP stage2_unix/obj/compiler-rt/lib/builtins/builtins.inputdeps.stamp
[95/161] STAMP stage2_iossim_x64/obj/compiler-rt/lib/builtins/builtins.inputdeps.stamp
[96/161] STAMP stage2_ios_aarch64/obj/compiler-rt/lib/builtins/builtins.inputdeps.stamp
[97/161] STAMP stage2_baremetal_aarch64/obj/compiler-rt/lib/builtins/builtins.inputdeps.stamp
[98/161] LINK ./bin/dexp
[99/161] LINK obj/llvm/unittests/CGData/CodeGenDataTests
[100/161] LINK ./bin/llvm-xray
[101/161] LINK ./bin/llvm-bolt-heatmap
[102/161] LINK ./bin/llvm-bolt
[103/161] LINK obj/bolt/unittests/Core/CoreTests
[104/161] ACTION //bolt/tools/driver:llvm-boltdiff(//llvm/utils/gn/build/toolchain:unix)
[105/161] ACTION //bolt/tools/driver:perf2bolt(//llvm/utils/gn/build/toolchain:unix)
[106/161] STAMP obj/bolt/tools/driver/perf2bolt.stamp
[107/161] STAMP obj/bolt/unittests/unittests.stamp
[108/161] STAMP obj/bolt/tools/driver/llvm-boltdiff.stamp
[109/161] STAMP obj/bolt/tools/driver/symlinks.stamp
[110/161] STAMP obj/bolt/test/test.stamp
[111/161] SOLINK ./lib/libLTO.dylib
[112/161] LINK obj/llvm/unittests/MC/MCTests
[113/161] LINK ./bin/opt
[114/161] STAMP obj/clang/test/test.stamp
[115/161] LINK obj/llvm/unittests/CodeGen/CodeGenTests
[116/161] LINK obj/llvm/unittests/CodeGen/GlobalISel/GlobalISelTests
[117/161] STAMP obj/lld/test/test.stamp
[118/161] LINK ./bin/clangd
[119/161] LINK ./bin/clangd-indexer
[120/161] STAMP obj/clang-tools-extra/clangd/xpc/framework/clangxpc_bundle_xpc_service_executable.stamp
[121/161] STAMP stage2_unix/obj/compiler-rt/lib/tsan/rtl/rtl.inputdeps.stamp
[122/161] STAMP obj/clang-tools-extra/clangd/xpc/framework/clangd.xpc.inputdeps.stamp
[123/161] STAMP stage2_unix/obj/compiler-rt/lib/ubsan/cxx_sources.inputdeps.stamp
[124/161] STAMP stage2_unix/obj/compiler-rt/lib/ubsan/sources.inputdeps.stamp
[125/161] STAMP stage2_unix/obj/compiler-rt/lib/ubsan/standalone_sources.inputdeps.stamp
[126/161] LINK obj/llvm/unittests/DebugInfo/GSYM/DebugInfoGSYMTests
[127/161] LINK obj/llvm/unittests/Passes/PassBuilderBindings/PassesBindingsTests
[128/161] LINK obj/llvm/unittests/ExecutionEngine/JITLink/JITLinkTests
[129/161] COPY_BUNDLE_DATA bin/clangd gen/clang-tools-extra/clangd/xpc/framework/clangd.xpc/Contents/MacOS/clangd
[130/161] STAMP stage2_unix/obj/libunwind/src/unwind_shared.inputdeps.stamp
[131/161] STAMP obj/clang-tools-extra/clangd/xpc/framework/clangd.xpc.stamp
[132/161] STAMP stage2_unix/obj/libunwind/src/unwind_static.inputdeps.stamp
[133/161] STAMP obj/clang-tools-extra/clangd/xpc/framework/clangdxpc_bundle_xpc.stamp
[134/161] STAMP stage2_unix/obj/libunwind/src/unwind_static_exported.inputdeps.stamp
[135/161] STAMP obj/clang-tools-extra/clangd/xpc/framework/ClangdXPC.framework.inputdeps.stamp
[136/161] STAMP stage2_unix/obj/compiler-rt/lib/interception/sources.inputdeps.stamp
[137/161] STAMP stage2_unix/obj/compiler-rt/lib/lsan/common_sources.inputdeps.stamp
[138/161] STAMP stage2_unix/obj/compiler-rt/lib/profile/profile.inputdeps.stamp
[139/161] ACTION //compiler-rt/test/asan:lit_site_cfg(//llvm/utils/gn/build/toolchain:stage2_unix)
[140/160] STAMP stage2_unix/obj/compiler-rt/lib/sanitizer_common/sources.inputdeps.stamp
[141/160] ACTION //compiler-rt/test/lsan:asan_mode_cfg(//llvm/utils/gn/build/toolchain:stage2_unix)
[142/159] ACTION //compiler-rt/test:lit_common_configured(//llvm/utils/gn/build/toolchain:stage2_unix)
[143/154] COPY_BUNDLE_DATA gen/clang-tools-extra/clangd/xpc/framework/clangd.xpc lib/ClangdXPC.framework/Versions/A/XPCServices/clangd.xpc
[144/154] STAMP obj/clang-tools-extra/clangd/xpc/framework/ClangdXPC.framework.stamp
[145/154] LINK obj/clang-tools-extra/clangd/unittests/ClangdTests
[146/154] LINK obj/llvm/unittests/MIR/MIRTests
[147/154] LINK ./bin/clangd-xpc-test-client
[148/154] STAMP obj/clang-tools-extra/clangd/test/test.stamp
[149/154] LINK obj/llvm/unittests/MI/MITests
[150/154] LINK obj/llvm/unittests/DebugInfo/LogicalView/DebugInfoLogicalViewTests
[151/154] LINK obj/llvm/unittests/DebugInfo/DWARF/DebugInfoDWARFTests
[152/154] STAMP obj/llvm/unittests/unittests.stamp
[153/154] STAMP obj/llvm/test/test.stamp
[154/154] STAMP obj/default.stamp
INFO:2025-03-20T07:14:24Z:root:analyze
skipping analyze because previous build was not green
INFO:2025-03-20T07:14:24Z:root:testing
INFO:2025-03-20T07:14:24Z:root:test check-clang
ninja: Entering directory `out/gn'
[0/2] ACTION //clang/test:check-clang(//llvm/utils/gn/build/toolchain:unix)
llvm-lit: /Users/thakis/src/llvm-project/llvm/utils/lit/lit/llvm/config.py:520: note: using clang: /Users/thakis/src/llvm-project/out/gn/bin/clang
llvm-lit: /Users/thakis/src/llvm-project/llvm/utils/lit/lit/llvm/subst.py:126: note: Did not find cir-opt in /Users/thakis/src/llvm-project/out/gn/bin:/Users/thakis/src/llvm-project/out/gn/bin
llvm-lit: /Users/thakis/src/llvm-project/llvm/utils/lit/lit/util.py:473: note: using SDKROOT: '/Applications/Xcode.app/Contents/Developer/Platforms/MacOSX.platform/Developer/SDKs/MacOSX13.1.sdk'
llvm-lit: /Users/thakis/src/llvm-project/llvm/utils/lit/lit/llvm/config.py:520: note: using ld.lld: /Users/thakis/src/llvm-project/out/gn/bin/ld.lld
llvm-lit: /Users/thakis/src/llvm-project/llvm/utils/lit/lit/llvm/config.py:520: note: using lld-link: /Users/thakis/src/llvm-project/out/gn/bin/lld-link
llvm-lit: /Users/thakis/src/llvm-project/llvm/utils/lit/lit/llvm/config.py:520: note: using ld64.lld: /Users/thakis/src/llvm-project/out/gn/bin/ld64.lld
llvm-lit: /Users/thakis/src/llvm-project/llvm/utils/lit/lit/llvm/config.py:520: note: using wasm-ld: /Users/thakis/src/llvm-project/out/gn/bin/wasm-ld
-- Testing: 21085 tests, 8 workers --
Testing:  0.. 10.. 20.. 30.. 40.. 50.. 60.. 70.. 80.. 90.. 

Testing Time: 737.45s

Total Discovered Tests: 46841
  Skipped          :    35 (0.07%)
  Unsupported      :   134 (0.29%)
  Passed           : 46638 (99.57%)
  Expectedly Failed:    34 (0.07%)
INFO:2025-03-20T07:27:01Z:root:test check-clang-tools
ninja: Entering directory `out/gn'
[0/2] ACTION //clang-tools-extra/test:check-clang-tools(//llvm/utils/gn/build/toolchain:unix)
llvm-lit: /Users/thakis/src/llvm-project/llvm/utils/lit/lit/llvm/config.py:520: note: using clang: /Users/thakis/src/llvm-project/out/gn/bin/clang
-- Testing: 1004 tests, 8 workers --
Testing:  0.. 10.. 20.. 30.. 40.. 50.. 60.. 70.. 80.. 90.. 

Testing Time: 68.63s

Total Discovered Tests: 1428
  Unsupported      :    3 (0.21%)
  Passed           : 1424 (99.72%)
  Expectedly Failed:    1 (0.07%)
INFO:2025-03-20T07:28:11Z:root:test check-clangd
ninja: Entering directory `out/gn'
[0/2] ACTION //clang-tools-extra/clangd/test:check-clangd(//llvm/utils/gn/build/toolchain:unix)
llvm-lit: /Users/thakis/src/llvm-project/llvm/utils/lit/lit/llvm/config.py:520: note: using clang: /Users/thakis/src/llvm-project/out/gn/bin/clang
-- Testing: 99 tests, 8 workers --
Testing:  0.. 10.. 20.. 30.. 40.. 50.. 60.. 70.. 80.. 90..

Testing Time: 19.18s

Total Discovered Tests: 1371
  Unsupported:    7 (0.51%)
  Passed     : 1364 (99.49%)
INFO:2025-03-20T07:28:34Z:root:test check-lld
ninja: Entering directory `out/gn'
[0/2] ACTION //lld/test:check-lld(//llvm/utils/gn/build/toolchain:unix)
llvm-lit: /Users/thakis/src/llvm-project/llvm/utils/lit/lit/llvm/config.py:520: note: using ld.lld: /Users/thakis/src/llvm-project/out/gn/bin/ld.lld
llvm-lit: /Users/thakis/src/llvm-project/llvm/utils/lit/lit/llvm/config.py:520: note: using lld-link: /Users/thakis/src/llvm-project/out/gn/bin/lld-link
llvm-lit: /Users/thakis/src/llvm-project/llvm/utils/lit/lit/llvm/config.py:520: note: using ld64.lld: /Users/thakis/src/llvm-project/out/gn/bin/ld64.lld
llvm-lit: /Users/thakis/src/llvm-project/llvm/utils/lit/lit/llvm/config.py:520: note: using wasm-ld: /Users/thakis/src/llvm-project/out/gn/bin/wasm-ld
-- Testing: 3070 tests, 8 workers --
Testing:  0.. 10.. 20.. 30.. 40.. 50.. 60.. 70.. 80.. 90..

Testing Time: 91.26s

Total Discovered Tests: 3070
  Unsupported      :   25 (0.81%)
  Passed           : 3044 (99.15%)
  Expectedly Failed:    1 (0.03%)
INFO:2025-03-20T07:30:09Z:root:test check-llvm
ninja: Entering directory `out/gn'
[0/2] ACTION //llvm/test:check-llvm(//llvm/utils/gn/build/toolchain:unix)
llvm-lit: /Users/thakis/src/llvm-project/llvm/utils/lit/lit/llvm/config.py:520: note: using ld.lld: /Users/thakis/src/llvm-project/out/gn/bin/ld.lld
llvm-lit: /Users/thakis/src/llvm-project/llvm/utils/lit/lit/llvm/config.py:520: note: using lld-link: /Users/thakis/src/llvm-project/out/gn/bin/lld-link
llvm-lit: /Users/thakis/src/llvm-project/llvm/utils/lit/lit/llvm/config.py:520: note: using ld64.lld: /Users/thakis/src/llvm-project/out/gn/bin/ld64.lld
llvm-lit: /Users/thakis/src/llvm-project/llvm/utils/lit/lit/llvm/config.py:520: note: using wasm-ld: /Users/thakis/src/llvm-project/out/gn/bin/wasm-ld
-- Testing: 56525 tests, 8 workers --
Testing: 
FAIL: LLVM :: tools/llvm-ml/struct.asm (1 of 56525)
******************** TEST 'LLVM :: tools/llvm-ml/struct.asm' FAILED ********************
Exit Code: 2

Command Output (stderr):
--
RUN: at line 1: llvm-ml64 -filetype=s /Users/thakis/src/llvm-project/llvm/test/tools/llvm-ml/struct.asm /Fo - | /Users/thakis/src/llvm-project/out/gn/bin/FileCheck /Users/thakis/src/llvm-project/llvm/test/tools/llvm-ml/struct.asm
+ llvm-ml64 -filetype=s /Users/thakis/src/llvm-project/llvm/test/tools/llvm-ml/struct.asm /Fo -
+ /Users/thakis/src/llvm-project/out/gn/bin/FileCheck /Users/thakis/src/llvm-project/llvm/test/tools/llvm-ml/struct.asm
/Users/thakis/src/llvm-project/out/gn/obj/llvm/test/tools/llvm-ml/Output/struct.asm.script: line 1: llvm-ml64: command not found
FileCheck error: '<stdin>' is empty.
FileCheck command line:  /Users/thakis/src/llvm-project/out/gn/bin/FileCheck /Users/thakis/src/llvm-project/llvm/test/tools/llvm-ml/struct.asm

--

********************
Testing: 
FAIL: LLVM :: tools/llvm-ml/indirect_branch.asm (2 of 56525)
******************** TEST 'LLVM :: tools/llvm-ml/indirect_branch.asm' FAILED ********************
Exit Code: 2

Command Output (stderr):
--
RUN: at line 1: llvm-ml64 -filetype=s /Users/thakis/src/llvm-project/llvm/test/tools/llvm-ml/indirect_branch.asm /Fo - | /Users/thakis/src/llvm-project/out/gn/bin/FileCheck /Users/thakis/src/llvm-project/llvm/test/tools/llvm-ml/indirect_branch.asm --check-prefixes=CHECK-64,CHECK
+ llvm-ml64 -filetype=s /Users/thakis/src/llvm-project/llvm/test/tools/llvm-ml/indirect_branch.asm /Fo -
/Users/thakis/src/llvm-project/out/gn/obj/llvm/test/tools/llvm-ml/Output/indirect_branch.asm.script: line 1: llvm-ml64: command not found
+ /Users/thakis/src/llvm-project/out/gn/bin/FileCheck /Users/thakis/src/llvm-project/llvm/test/tools/llvm-ml/indirect_branch.asm --check-prefixes=CHECK-64,CHECK
FileCheck error: '<stdin>' is empty.
FileCheck command line:  /Users/thakis/src/llvm-project/out/gn/bin/FileCheck /Users/thakis/src/llvm-project/llvm/test/tools/llvm-ml/indirect_branch.asm --check-prefixes=CHECK-64,CHECK

--

********************
Testing: 
FAIL: LLVM :: tools/llvm-ml/repeat_directives.asm (3 of 56525)
******************** TEST 'LLVM :: tools/llvm-ml/repeat_directives.asm' FAILED ********************
Exit Code: 2

Command Output (stderr):
--
RUN: at line 1: llvm-ml64 -filetype=s /Users/thakis/src/llvm-project/llvm/test/tools/llvm-ml/repeat_directives.asm /Fo - | /Users/thakis/src/llvm-project/out/gn/bin/FileCheck /Users/thakis/src/llvm-project/llvm/test/tools/llvm-ml/repeat_directives.asm
+ llvm-ml64 -filetype=s /Users/thakis/src/llvm-project/llvm/test/tools/llvm-ml/repeat_directives.asm /Fo -
/Users/thakis/src/llvm-project/out/gn/obj/llvm/test/tools/llvm-ml/Output/repeat_directives.asm.script: line 1: llvm-ml64: command not found
+ /Users/thakis/src/llvm-project/out/gn/bin/FileCheck /Users/thakis/src/llvm-project/llvm/test/tools/llvm-ml/repeat_directives.asm
FileCheck error: '<stdin>' is empty.
FileCheck command line:  /Users/thakis/src/llvm-project/out/gn/bin/FileCheck /Users/thakis/src/llvm-project/llvm/test/tools/llvm-ml/repeat_directives.asm

--

********************
Testing: 
FAIL: LLVM :: tools/llvm-ml/macro.asm (4 of 56525)
******************** TEST 'LLVM :: tools/llvm-ml/macro.asm' FAILED ********************
Exit Code: 2

Command Output (stderr):
--
RUN: at line 1: llvm-ml64 -filetype=s /Users/thakis/src/llvm-project/llvm/test/tools/llvm-ml/macro.asm /Fo - | /Users/thakis/src/llvm-project/out/gn/bin/FileCheck /Users/thakis/src/llvm-project/llvm/test/tools/llvm-ml/macro.asm
+ llvm-ml64 -filetype=s /Users/thakis/src/llvm-project/llvm/test/tools/llvm-ml/macro.asm /Fo -
/Users/thakis/src/llvm-project/out/gn/obj/llvm/test/tools/llvm-ml/Output/macro.asm.script: line 1: llvm-ml64: command not found
+ /Users/thakis/src/llvm-project/out/gn/bin/FileCheck /Users/thakis/src/llvm-project/llvm/test/tools/llvm-ml/macro.asm
FileCheck error: '<stdin>' is empty.
FileCheck command line:  /Users/thakis/src/llvm-project/out/gn/bin/FileCheck /Users/thakis/src/llvm-project/llvm/test/tools/llvm-ml/macro.asm

--

********************
Testing: 
FAIL: LLVM :: tools/llvm-ml/proc_frame.asm (5 of 56525)
******************** TEST 'LLVM :: tools/llvm-ml/proc_frame.asm' FAILED ********************
Exit Code: 2

Command Output (stderr):
--
RUN: at line 1: llvm-ml64 -filetype=s /Users/thakis/src/llvm-project/llvm/test/tools/llvm-ml/proc_frame.asm /Fo - | /Users/thakis/src/llvm-project/out/gn/bin/FileCheck /Users/thakis/src/llvm-project/llvm/test/tools/llvm-ml/proc_frame.asm
+ llvm-ml64 -filetype=s /Users/thakis/src/llvm-project/llvm/test/tools/llvm-ml/proc_frame.asm /Fo -
/Users/thakis/src/llvm-project/out/gn/obj/llvm/test/tools/llvm-ml/Output/proc_frame.asm.script: line 1: llvm-ml64: command not found
+ /Users/thakis/src/llvm-project/out/gn/bin/FileCheck /Users/thakis/src/llvm-project/llvm/test/tools/llvm-ml/proc_frame.asm
FileCheck error: '<stdin>' is empty.
FileCheck command line:  /Users/thakis/src/llvm-project/out/gn/bin/FileCheck /Users/thakis/src/llvm-project/llvm/test/tools/llvm-ml/proc_frame.asm

--

********************
Testing: 
FAIL: LLVM :: tools/llvm-ml/dot_operator.asm (6 of 56525)
******************** TEST 'LLVM :: tools/llvm-ml/dot_operator.asm' FAILED ********************
Exit Code: 2

Command Output (stderr):
--
RUN: at line 1: llvm-ml64 -filetype=s /Users/thakis/src/llvm-project/llvm/test/tools/llvm-ml/dot_operator.asm /Fo - | /Users/thakis/src/llvm-project/out/gn/bin/FileCheck /Users/thakis/src/llvm-project/llvm/test/tools/llvm-ml/dot_operator.asm
+ llvm-ml64 -filetype=s /Users/thakis/src/llvm-project/llvm/test/tools/llvm-ml/dot_operator.asm /Fo -
/Users/thakis/src/llvm-project/out/gn/obj/llvm/test/tools/llvm-ml/Output/dot_operator.asm.script: line 1: llvm-ml64: command not found
+ /Users/thakis/src/llvm-project/out/gn/bin/FileCheck /Users/thakis/src/llvm-project/llvm/test/tools/llvm-ml/dot_operator.asm
FileCheck error: '<stdin>' is empty.
FileCheck command line:  /Users/thakis/src/llvm-project/out/gn/bin/FileCheck /Users/thakis/src/llvm-project/llvm/test/tools/llvm-ml/dot_operator.asm

--

********************
Testing: 
FAIL: LLVM :: tools/llvm-ml/architecture.asm (7 of 56525)
******************** TEST 'LLVM :: tools/llvm-ml/architecture.asm' FAILED ********************
Exit Code: 2

Command Output (stderr):
--
RUN: at line 1: llvm-ml64 -filetype=s /Users/thakis/src/llvm-project/llvm/test/tools/llvm-ml/architecture.asm /Fo - | /Users/thakis/src/llvm-project/out/gn/bin/FileCheck /Users/thakis/src/llvm-project/llvm/test/tools/llvm-ml/architecture.asm --implicit-check-not=error:
+ llvm-ml64 -filetype=s /Users/thakis/src/llvm-project/llvm/test/tools/llvm-ml/architecture.asm /Fo -
/Users/thakis/src/llvm-project/out/gn/obj/llvm/test/tools/llvm-ml/Output/architecture.asm.script: line 1: llvm-ml64: command not found
+ /Users/thakis/src/llvm-project/out/gn/bin/FileCheck /Users/thakis/src/llvm-project/llvm/test/tools/llvm-ml/architecture.asm --implicit-check-not=error:
FileCheck error: '<stdin>' is empty.
FileCheck command line:  /Users/thakis/src/llvm-project/out/gn/bin/FileCheck /Users/thakis/src/llvm-project/llvm/test/tools/llvm-ml/architecture.asm --implicit-check-not=error:

--

********************
Testing: 
FAIL: LLVM :: tools/llvm-ml/strings_errors.asm (8 of 56525)
******************** TEST 'LLVM :: tools/llvm-ml/strings_errors.asm' FAILED ********************
Exit Code: 1

Command Output (stderr):
--
RUN: at line 1: not llvm-ml64 -filetype=s /Users/thakis/src/llvm-project/llvm/test/tools/llvm-ml/strings_errors.asm /Fo /dev/null 2>&1 | /Users/thakis/src/llvm-project/out/gn/bin/FileCheck /Users/thakis/src/llvm-project/llvm/test/tools/llvm-ml/strings_errors.asm --implicit-check-not=error:
+ not llvm-ml64 -filetype=s /Users/thakis/src/llvm-project/llvm/test/tools/llvm-ml/strings_errors.asm /Fo /dev/null
+ /Users/thakis/src/llvm-project/out/gn/bin/FileCheck /Users/thakis/src/llvm-project/llvm/test/tools/llvm-ml/strings_errors.asm --implicit-check-not=error:
/Users/thakis/src/llvm-project/llvm/test/tools/llvm-ml/strings_errors.asm:9:10: error: CHECK: expected string not found in input
; CHECK: error: literal value out of range
         ^
<stdin>:1:1: note: scanning from here
error: unable to find `llvm-ml64' in PATH: No such file or directory
^
<stdin>:1:55: note: possible intended match here
error: unable to find `llvm-ml64' in PATH: No such file or directory
                                                      ^

Input file: <stdin>
Check file: /Users/thakis/src/llvm-project/llvm/test/tools/llvm-ml/strings_errors.asm

-dump-input=help explains the following input dump.

Input was:
<<<<<<
           1: error: unable to find `llvm-ml64' in PATH: No such file or directory 
check:9'0     X~~~~~~~~~~~~~~~~~~~~~~~~~~~~~~~~~~~~~~~~~~~~~~~~~~~~~~~~~~~~~~~~~~~~ error: no match found
check:9'1                                                           ?               possible intended match
>>>>>>

--

********************
Testing: 
FAIL: LLVM :: tools/llvm-ml/extern.asm (9 of 56525)
******************** TEST 'LLVM :: tools/llvm-ml/extern.asm' FAILED ********************
Exit Code: 2

Command Output (stderr):
--
RUN: at line 1: llvm-ml -filetype=s /Users/thakis/src/llvm-project/llvm/test/tools/llvm-ml/extern.asm /Fo - | /Users/thakis/src/llvm-project/out/gn/bin/FileCheck /Users/thakis/src/llvm-project/llvm/test/tools/llvm-ml/extern.asm --check-prefixes=CHECK,CHECK-32
+ llvm-ml -filetype=s /Users/thakis/src/llvm-project/llvm/test/tools/llvm-ml/extern.asm /Fo -
+ /Users/thakis/src/llvm-project/out/gn/bin/FileCheck /Users/thakis/src/llvm-project/llvm/test/tools/llvm-ml/extern.asm --check-prefixes=CHECK,CHECK-32
RUN: at line 2: llvm-ml64 -filetype=s /Users/thakis/src/llvm-project/llvm/test/tools/llvm-ml/extern.asm /Fo - | /Users/thakis/src/llvm-project/out/gn/bin/FileCheck /Users/thakis/src/llvm-project/llvm/test/tools/llvm-ml/extern.asm --check-prefixes=CHECK,CHECK-64
+ llvm-ml64 -filetype=s /Users/thakis/src/llvm-project/llvm/test/tools/llvm-ml/extern.asm /Fo -
/Users/thakis/src/llvm-project/out/gn/obj/llvm/test/tools/llvm-ml/Output/extern.asm.script: line 2: llvm-ml64: command not found
+ /Users/thakis/src/llvm-project/out/gn/bin/FileCheck /Users/thakis/src/llvm-project/llvm/test/tools/llvm-ml/extern.asm --check-prefixes=CHECK,CHECK-64
FileCheck error: '<stdin>' is empty.
FileCheck command line:  /Users/thakis/src/llvm-project/out/gn/bin/FileCheck /Users/thakis/src/llvm-project/llvm/test/tools/llvm-ml/extern.asm --check-prefixes=CHECK,CHECK-64

--

********************
Testing: 
FAIL: LLVM :: tools/llvm-ml/proc.asm (10 of 56525)
******************** TEST 'LLVM :: tools/llvm-ml/proc.asm' FAILED ********************
Exit Code: 2

Command Output (stderr):
--
RUN: at line 1: llvm-ml -filetype=s /Users/thakis/src/llvm-project/llvm/test/tools/llvm-ml/proc.asm /Fo - | /Users/thakis/src/llvm-project/out/gn/bin/FileCheck /Users/thakis/src/llvm-project/llvm/test/tools/llvm-ml/proc.asm
+ llvm-ml -filetype=s /Users/thakis/src/llvm-project/llvm/test/tools/llvm-ml/proc.asm /Fo -
+ /Users/thakis/src/llvm-project/out/gn/bin/FileCheck /Users/thakis/src/llvm-project/llvm/test/tools/llvm-ml/proc.asm
RUN: at line 2: llvm-ml64 -filetype=s /Users/thakis/src/llvm-project/llvm/test/tools/llvm-ml/proc.asm /Fo - | /Users/thakis/src/llvm-project/out/gn/bin/FileCheck /Users/thakis/src/llvm-project/llvm/test/tools/llvm-ml/proc.asm
+ /Users/thakis/src/llvm-project/out/gn/bin/FileCheck /Users/thakis/src/llvm-project/llvm/test/tools/llvm-ml/proc.asm
+ llvm-ml64 -filetype=s /Users/thakis/src/llvm-project/llvm/test/tools/llvm-ml/proc.asm /Fo -
/Users/thakis/src/llvm-project/out/gn/obj/llvm/test/tools/llvm-ml/Output/proc.asm.script: line 2: llvm-ml64: command not found
FileCheck error: '<stdin>' is empty.
FileCheck command line:  /Users/thakis/src/llvm-project/out/gn/bin/FileCheck /Users/thakis/src/llvm-project/llvm/test/tools/llvm-ml/proc.asm

--

********************
Testing: 
FAIL: LLVM :: tools/llvm-ml/rip_relative_addressing.asm (11 of 56525)
******************** TEST 'LLVM :: tools/llvm-ml/rip_relative_addressing.asm' FAILED ********************
Exit Code: 2

Command Output (stderr):
--
RUN: at line 1: llvm-ml -filetype=s /Users/thakis/src/llvm-project/llvm/test/tools/llvm-ml/rip_relative_addressing.asm /Fo - | /Users/thakis/src/llvm-project/out/gn/bin/FileCheck /Users/thakis/src/llvm-project/llvm/test/tools/llvm-ml/rip_relative_addressing.asm --check-prefixes=CHECK,CHECK-32
+ llvm-ml -filetype=s /Users/thakis/src/llvm-project/llvm/test/tools/llvm-ml/rip_relative_addressing.asm /Fo -
+ /Users/thakis/src/llvm-project/out/gn/bin/FileCheck /Users/thakis/src/llvm-project/llvm/test/tools/llvm-ml/rip_relative_addressing.asm --check-prefixes=CHECK,CHECK-32
RUN: at line 2: llvm-ml64 -filetype=s /Users/thakis/src/llvm-project/llvm/test/tools/llvm-ml/rip_relative_addressing.asm /Fo - | /Users/thakis/src/llvm-project/out/gn/bin/FileCheck /Users/thakis/src/llvm-project/llvm/test/tools/llvm-ml/rip_relative_addressing.asm --check-prefixes=CHECK,CHECK-64
+ llvm-ml64 -filetype=s /Users/thakis/src/llvm-project/llvm/test/tools/llvm-ml/rip_relative_addressing.asm /Fo -
+ /Users/thakis/src/llvm-project/out/gn/bin/FileCheck /Users/thakis/src/llvm-project/llvm/test/tools/llvm-ml/rip_relative_addressing.asm --check-prefixes=CHECK,CHECK-64
/Users/thakis/src/llvm-project/out/gn/obj/llvm/test/tools/llvm-ml/Output/rip_relative_addressing.asm.script: line 2: llvm-ml64: command not found
FileCheck error: '<stdin>' is empty.
FileCheck command line:  /Users/thakis/src/llvm-project/out/gn/bin/FileCheck /Users/thakis/src/llvm-project/llvm/test/tools/llvm-ml/rip_relative_addressing.asm --check-prefixes=CHECK,CHECK-64

--

********************
Testing: 
FAIL: LLVM :: tools/llvm-ml/nested_proc.asm (12 of 56525)
******************** TEST 'LLVM :: tools/llvm-ml/nested_proc.asm' FAILED ********************
Exit Code: 2

Command Output (stderr):
--
RUN: at line 1: llvm-ml -filetype=s /Users/thakis/src/llvm-project/llvm/test/tools/llvm-ml/nested_proc.asm /Fo - | /Users/thakis/src/llvm-project/out/gn/bin/FileCheck /Users/thakis/src/llvm-project/llvm/test/tools/llvm-ml/nested_proc.asm
+ llvm-ml -filetype=s /Users/thakis/src/llvm-project/llvm/test/tools/llvm-ml/nested_proc.asm /Fo -
+ /Users/thakis/src/llvm-project/out/gn/bin/FileCheck /Users/thakis/src/llvm-project/llvm/test/tools/llvm-ml/nested_proc.asm
RUN: at line 2: llvm-ml64 -filetype=s /Users/thakis/src/llvm-project/llvm/test/tools/llvm-ml/nested_proc.asm /Fo - | /Users/thakis/src/llvm-project/out/gn/bin/FileCheck /Users/thakis/src/llvm-project/llvm/test/tools/llvm-ml/nested_proc.asm
+ llvm-ml64 -filetype=s /Users/thakis/src/llvm-project/llvm/test/tools/llvm-ml/nested_proc.asm /Fo -
/Users/thakis/src/llvm-project/out/gn/obj/llvm/test/tools/llvm-ml/Output/nested_proc.asm.script: line 2: llvm-ml64: command not found
+ /Users/thakis/src/llvm-project/out/gn/bin/FileCheck /Users/thakis/src/llvm-project/llvm/test/tools/llvm-ml/nested_proc.asm
FileCheck error: '<stdin>' is empty.
FileCheck command line:  /Users/thakis/src/llvm-project/out/gn/bin/FileCheck /Users/thakis/src/llvm-project/llvm/test/tools/llvm-ml/nested_proc.asm

--

********************
Testing: 
FAIL: LLVM :: tools/llvm-ml/architecture_errors.asm (13 of 56525)
******************** TEST 'LLVM :: tools/llvm-ml/architecture_errors.asm' FAILED ********************
Exit Code: 1

Command Output (stderr):
--
RUN: at line 1: not llvm-ml -filetype=s /Users/thakis/src/llvm-project/llvm/test/tools/llvm-ml/architecture_errors.asm /Fo - 2>&1 | /Users/thakis/src/llvm-project/out/gn/bin/FileCheck /Users/thakis/src/llvm-project/llvm/test/tools/llvm-ml/architecture_errors.asm
+ not llvm-ml -filetype=s /Users/thakis/src/llvm-project/llvm/test/tools/llvm-ml/architecture_errors.asm /Fo -
+ /Users/thakis/src/llvm-project/out/gn/bin/FileCheck /Users/thakis/src/llvm-project/llvm/test/tools/llvm-ml/architecture_errors.asm
RUN: at line 2: not llvm-ml -m32 -filetype=s /Users/thakis/src/llvm-project/llvm/test/tools/llvm-ml/architecture_errors.asm /Fo - 2>&1 | /Users/thakis/src/llvm-project/out/gn/bin/FileCheck /Users/thakis/src/llvm-project/llvm/test/tools/llvm-ml/architecture_errors.asm
+ not llvm-ml -m32 -filetype=s /Users/thakis/src/llvm-project/llvm/test/tools/llvm-ml/architecture_errors.asm /Fo -
+ /Users/thakis/src/llvm-project/out/gn/bin/FileCheck /Users/thakis/src/llvm-project/llvm/test/tools/llvm-ml/architecture_errors.asm
RUN: at line 3: not llvm-ml64 -m32 -filetype=s /Users/thakis/src/llvm-project/llvm/test/tools/llvm-ml/architecture_errors.asm /Fo - 2>&1 | /Users/thakis/src/llvm-project/out/gn/bin/FileCheck /Users/thakis/src/llvm-project/llvm/test/tools/llvm-ml/architecture_errors.asm
+ not llvm-ml64 -m32 -filetype=s /Users/thakis/src/llvm-project/llvm/test/tools/llvm-ml/architecture_errors.asm /Fo -
+ /Users/thakis/src/llvm-project/out/gn/bin/FileCheck /Users/thakis/src/llvm-project/llvm/test/tools/llvm-ml/architecture_errors.asm
/Users/thakis/src/llvm-project/llvm/test/tools/llvm-ml/architecture_errors.asm:7:10: error: CHECK: expected string not found in input
; CHECK: :[[# @LINE + 1]]:5: error: register %rax is only available in 64-bit mode
         ^
<stdin>:1:1: note: scanning from here
error: unable to find `llvm-ml64' in PATH: No such file or directory
^
<stdin>:1:1: note: with " @LINE + 1" equal to "8"
error: unable to find `llvm-ml64' in PATH: No such file or directory
^
<stdin>:1:30: note: possible intended match here
error: unable to find `llvm-ml64' in PATH: No such file or directory
                             ^

Input file: <stdin>
Check file: /Users/thakis/src/llvm-project/llvm/test/tools/llvm-ml/architecture_errors.asm

-dump-input=help explains the following input dump.

Input was:
<<<<<<
           1: error: unable to find `llvm-ml64' in PATH: No such file or directory 
check:7'0     X~~~~~~~~~~~~~~~~~~~~~~~~~~~~~~~~~~~~~~~~~~~~~~~~~~~~~~~~~~~~~~~~~~~~ error: no match found
check:7'1                                                                           with " @LINE + 1" equal to "8"
check:7'2                                  ?                                        possible intended match
>>>>>>

--

********************
Testing: 
FAIL: LLVM :: tools/llvm-ml/feat00.asm (14 of 56525)
******************** TEST 'LLVM :: tools/llvm-ml/feat00.asm' FAILED ********************
Exit Code: 2

Command Output (stderr):
--
RUN: at line 1: llvm-ml /Users/thakis/src/llvm-project/llvm/test/tools/llvm-ml/feat00.asm /Fo - | /Users/thakis/src/llvm-project/out/gn/bin/llvm-readobj --syms - | /Users/thakis/src/llvm-project/out/gn/bin/FileCheck /Users/thakis/src/llvm-project/llvm/test/tools/llvm-ml/feat00.asm --check-prefix=CHECK-OBJ --check-prefix=CHECK-OBJ-NOSAFESEH
+ llvm-ml /Users/thakis/src/llvm-project/llvm/test/tools/llvm-ml/feat00.asm /Fo -
+ /Users/thakis/src/llvm-project/out/gn/bin/llvm-readobj --syms -
+ /Users/thakis/src/llvm-project/out/gn/bin/FileCheck /Users/thakis/src/llvm-project/llvm/test/tools/llvm-ml/feat00.asm --check-prefix=CHECK-OBJ --check-prefix=CHECK-OBJ-NOSAFESEH
RUN: at line 2: llvm-ml64 /Users/thakis/src/llvm-project/llvm/test/tools/llvm-ml/feat00.asm /Fo - | /Users/thakis/src/llvm-project/out/gn/bin/llvm-readobj --syms - | /Users/thakis/src/llvm-project/out/gn/bin/FileCheck /Users/thakis/src/llvm-project/llvm/test/tools/llvm-ml/feat00.asm --check-prefix=CHECK-OBJ --check-prefix=CHECK-OBJ-NOSAFESEH
+ llvm-ml64 /Users/thakis/src/llvm-project/llvm/test/tools/llvm-ml/feat00.asm /Fo -
/Users/thakis/src/llvm-project/out/gn/obj/llvm/test/tools/llvm-ml/Output/feat00.asm.script: line 2: llvm-ml64: command not found
+ /Users/thakis/src/llvm-project/out/gn/bin/llvm-readobj --syms -
+ /Users/thakis/src/llvm-project/out/gn/bin/FileCheck /Users/thakis/src/llvm-project/llvm/test/tools/llvm-ml/feat00.asm --check-prefix=CHECK-OBJ --check-prefix=CHECK-OBJ-NOSAFESEH
/Users/thakis/src/llvm-project/out/gn/bin/llvm-readobj: error: '<stdin>': The file was not recognized as a valid object file
FileCheck error: '<stdin>' is empty.
FileCheck command line:  /Users/thakis/src/llvm-project/out/gn/bin/FileCheck /Users/thakis/src/llvm-project/llvm/test/tools/llvm-ml/feat00.asm --check-prefix=CHECK-OBJ --check-prefix=CHECK-OBJ-NOSAFESEH

--

********************
Testing: 
FAIL: LLVM :: tools/llvm-ml/feat00_override.asm (15 of 56525)
******************** TEST 'LLVM :: tools/llvm-ml/feat00_override.asm' FAILED ********************
Exit Code: 2

Command Output (stderr):
--
RUN: at line 1: llvm-ml /Users/thakis/src/llvm-project/llvm/test/tools/llvm-ml/feat00_override.asm /Fo - | /Users/thakis/src/llvm-project/out/gn/bin/llvm-readobj --syms - | /Users/thakis/src/llvm-project/out/gn/bin/FileCheck /Users/thakis/src/llvm-project/llvm/test/tools/llvm-ml/feat00_override.asm
+ llvm-ml /Users/thakis/src/llvm-project/llvm/test/tools/llvm-ml/feat00_override.asm /Fo -
+ /Users/thakis/src/llvm-project/out/gn/bin/llvm-readobj --syms -
+ /Users/thakis/src/llvm-project/out/gn/bin/FileCheck /Users/thakis/src/llvm-project/llvm/test/tools/llvm-ml/feat00_override.asm
RUN: at line 2: llvm-ml64 /Users/thakis/src/llvm-project/llvm/test/tools/llvm-ml/feat00_override.asm /Fo - | /Users/thakis/src/llvm-project/out/gn/bin/llvm-readobj --syms - | /Users/thakis/src/llvm-project/out/gn/bin/FileCheck /Users/thakis/src/llvm-project/llvm/test/tools/llvm-ml/feat00_override.asm
+ llvm-ml64 /Users/thakis/src/llvm-project/llvm/test/tools/llvm-ml/feat00_override.asm /Fo -
/Users/thakis/src/llvm-project/out/gn/obj/llvm/test/tools/llvm-ml/Output/feat00_override.asm.script: line 2: llvm-ml64: command not found
+ /Users/thakis/src/llvm-project/out/gn/bin/llvm-readobj --syms -
+ /Users/thakis/src/llvm-project/out/gn/bin/FileCheck /Users/thakis/src/llvm-project/llvm/test/tools/llvm-ml/feat00_override.asm
/Users/thakis/src/llvm-project/out/gn/bin/llvm-readobj: error: '<stdin>': The file was not recognized as a valid object file
FileCheck error: '<stdin>' is empty.
FileCheck command line:  /Users/thakis/src/llvm-project/out/gn/bin/FileCheck /Users/thakis/src/llvm-project/llvm/test/tools/llvm-ml/feat00_override.asm

--

********************
Testing:  0.. 10.. 20.. 30.. 40.. 50.. 60.. 70.. 80.. 90..
********************
Failed Tests (15):
  LLVM :: tools/llvm-ml/architecture.asm
  LLVM :: tools/llvm-ml/architecture_errors.asm
  LLVM :: tools/llvm-ml/dot_operator.asm
  LLVM :: tools/llvm-ml/extern.asm
  LLVM :: tools/llvm-ml/feat00.asm
  LLVM :: tools/llvm-ml/feat00_override.asm
  LLVM :: tools/llvm-ml/indirect_branch.asm
  LLVM :: tools/llvm-ml/macro.asm
  LLVM :: tools/llvm-ml/nested_proc.asm
  LLVM :: tools/llvm-ml/proc.asm
  LLVM :: tools/llvm-ml/proc_frame.asm
  LLVM :: tools/llvm-ml/repeat_directives.asm
  LLVM :: tools/llvm-ml/rip_relative_addressing.asm
  LLVM :: tools/llvm-ml/strings_errors.asm
  LLVM :: tools/llvm-ml/struct.asm


Testing Time: 826.53s

Total Discovered Tests: 64605
  Skipped          :    32 (0.05%)
  Unsupported      :  2340 (3.62%)
  Passed           : 62040 (96.03%)
  Passed With Retry:     1 (0.00%)
  Expectedly Failed:   177 (0.27%)
  Failed           :    15 (0.02%)
FAILED: gen/llvm/test/run-lit 
python3 bin/llvm-lit -sv ../../llvm/test
ninja: build stopped: subcommand failed.
Command '['ninja', '-C', 'out/gn', 'check-llvm']' returned non-zero exit status 1.